{"text_format":"1","workbook":"xlsx","n_sheets":31,"sheets":["Point Score","8-12-13","15-12-13","12-01-14","19-01-14","26-01-14","2-02-14","9-02-14","16-02-14","23-02-14","16-03-14","23-03-14","30-03-14","13-10-13","20-10-13","27-10-13","3-11-13","10-11-13","17-11-13","24-11-13","1-12-13","BLANK","Contacts","Starters","Entrants","Schedule","11-03-12","18-03-12","25-03-12","2011-12","Point Score OLD"],"not_rendered":{"charts":0,"images":0,"macros":1,"external_links":0,"defined_names":31,"comments":23,"pivot_tables":0},"unopened":[],"bounds":{"document_bytes":16777216,"sheet_cells":100000,"rows_first":2000,"rows_last":500,"rows_between":2000,"halvings":0,"cell_chars":16384,"cell_head_chars":4096},"cells_cut":0,"cells_raw":0,"read":"whole","date_system":"1900"}

{"sheet":"Point Score","index":0,"n_rows":177,"n_cols":37,"rows_kept":177,"cut":false,"hidden":false,"merged":[]}
["AUSTRALIAN 18Ft League - 2013/14 Club Championship Point Score",null,null,null,null,null,null,null,null,null,null,null,null,null,null,null,null,null,null,null,null,null,null,null,null,null,null,null,null,null,null,"Ctrl+R to Sort by Recall"]
[null,null,{"$f":"'10-11-13'!G4","v":"2013-11-10"},{"$f":"'15-12-13'!G4","v":"2013-12-15"},{"$f":"'12-01-14'!G4","v":"2014-01-12"},{"$f":"'19-01-14'!G4","v":"2014-01-19"},{"$f":"'26-01-14'!G4","v":"2014-01-26"},{"$f":"'2-02-14'!G4","v":"2014-02-02"},{"$f":"'9-02-14'!G4","v":"2014-02-09"},{"$f":"'16-02-14'!G4","v":"2014-02-16"},{"$f":"'16-03-14'!G4","v":"2014-02-23"},{"$f":"'30-03-14'!G4","v":"2014-03-30"},{"$f":"'25-03-12'!G4","v":"00:00:00"},null,null,null,null,null,null,null,null,null,null,null,null,null,null,null,null,null,null,"Ctrl+P to Sort by Points"]
["Recall","Name","R1","R2","R3","R4","R5","R6","R7","R8","R9","R10","R11",null,null,null,null,"Total","POS"]
[7,"GOTTA LOVE IT 7",{"$f":"'10-11-13'!$P21","v":1},{"$f":"'15-12-13'!$P21","v":0},{"$f":"'12-01-14'!$P21","v":0},{"$f":"'19-01-14'!$P21","v":0},{"$f":"'26-01-14'!$P21","v":0},{"$f":"'2-02-14'!$P21","v":0},{"$f":"'9-02-14'!$P21","v":0},{"$f":"'16-02-14'!$P21","v":0},{"$f":"'16-03-14'!$P21","v":0},{"$f":"'30-03-14'!$P21","v":0},{"$f":"'25-03-12'!$P21","v":0},null,null,null,null,{"$f":"SUM(C4:Q4)","v":1},1]
[1,"THURLOW FISHER LAWYERS",{"$f":"'10-11-13'!$P15","v":2},{"$f":"'15-12-13'!$P15","v":0},{"$f":"'12-01-14'!$P15","v":0},{"$f":"'19-01-14'!$P15","v":0},{"$f":"'26-01-14'!$P15","v":0},{"$f":"'2-02-14'!$P15","v":0},{"$f":"'9-02-14'!$P15","v":0},{"$f":"'16-02-14'!$P15","v":0},{"$f":"'16-03-14'!$P15","v":0},{"$f":"'30-03-14'!$P15","v":0},{"$f":"'25-03-12'!$P15","v":0},null,null,null,null,2,2]
[8,"SMEG",{"$f":"'10-11-13'!$P22","v":3},{"$f":"'15-12-13'!$P22","v":0},{"$f":"'12-01-14'!$P22","v":0},{"$f":"'19-01-14'!$P22","v":0},{"$f":"'26-01-14'!$P22","v":0},{"$f":"'2-02-14'!$P22","v":0},{"$f":"'9-02-14'!$P22","v":0},{"$f":"'16-02-14'!$P22","v":0},{"$f":"'16-03-14'!$P22","v":0},{"$f":"'30-03-14'!$P22","v":0},{"$f":"'25-03-12'!$P22","v":0},null,null,null,null,3,3]
[16,"SYDNEY CITY MARINE",{"$f":"'10-11-13'!$P30","v":4},{"$f":"'15-12-13'!$P30","v":0},{"$f":"'12-01-14'!$P30","v":0},{"$f":"'19-01-14'!$P30","v":0},{"$f":"'26-01-14'!$P30","v":0},{"$f":"'2-02-14'!$P30","v":0},{"$f":"'9-02-14'!$P30","v":0},{"$f":"'16-02-14'!$P30","v":0},{"$f":"'16-03-14'!$P30","v":0},{"$f":"'30-03-14'!$P30","v":0},{"$f":"'25-03-12'!$P30","v":0},null,null,null,null,4,4]
[5,"APPLIANCESONLINE.COM.AU",{"$f":"'10-11-13'!$P19","v":5},{"$f":"'15-12-13'!$P19","v":0},{"$f":"'12-01-14'!$P19","v":0},{"$f":"'19-01-14'!$P19","v":0},{"$f":"'26-01-14'!$P19","v":0},{"$f":"'2-02-14'!$P19","v":0},{"$f":"'9-02-14'!$P19","v":0},{"$f":"'16-02-14'!$P19","v":0},{"$f":"'16-03-14'!$P19","v":0},{"$f":"'30-03-14'!$P19","v":0},{"$f":"'25-03-12'!$P19","v":0},null,null,null,null,5,5]
[13,"RABBITOHS-KENWOOD",5.4,{"$f":"'15-12-13'!$P27","v":0},{"$f":"'12-01-14'!$P27","v":0},{"$f":"'19-01-14'!$P27","v":0},{"$f":"'26-01-14'!$P27","v":0},{"$f":"'2-02-14'!$P27","v":0},{"$f":"'9-02-14'!$P27","v":0},{"$f":"'16-02-14'!$P27","v":0},{"$f":"'16-03-14'!$P27","v":0},{"$f":"'30-03-14'!$P27","v":0},{"$f":"'25-03-12'!$P27","v":0},null,null,null,null,5.4,6]
[12,"LUMIX",{"$f":"'10-11-13'!$P26","v":6},{"$f":"'15-12-13'!$P26","v":0},{"$f":"'12-01-14'!$P26","v":0},{"$f":"'19-01-14'!$P26","v":0},{"$f":"'26-01-14'!$P26","v":0},{"$f":"'2-02-14'!$P26","v":0},{"$f":"'9-02-14'!$P26","v":0},{"$f":"'16-02-14'!$P26","v":0},{"$f":"'16-03-14'!$P26","v":0},{"$f":"'30-03-14'!$P26","v":0},{"$f":"'25-03-12'!$P26","v":0},null,null,null,null,6,7]
[10,"FISHER & PAYKEL",{"$f":"'10-11-13'!$P24","v":7},{"$f":"'15-12-13'!$P24","v":0},{"$f":"'12-01-14'!$P24","v":0},{"$f":"'19-01-14'!$P24","v":0},{"$f":"'26-01-14'!$P24","v":0},{"$f":"'2-02-14'!$P24","v":0},{"$f":"'9-02-14'!$P24","v":0},{"$f":"'16-02-14'!$P24","v":0},{"$f":"'16-03-14'!$P24","v":0},{"$f":"'30-03-14'!$P24","v":0},{"$f":"'25-03-12'!$P24","v":0},null,null,null,null,7,8]
[6,"COOPERS 62-RAG & FAMISH HOTEL",{"$f":"'10-11-13'!$P20","v":9},{"$f":"'15-12-13'!$P20","v":0},{"$f":"'12-01-14'!$P20","v":0},{"$f":"'19-01-14'!$P20","v":0},{"$f":"'26-01-14'!$P20","v":0},{"$f":"'2-02-14'!$P20","v":0},{"$f":"'9-02-14'!$P20","v":0},{"$f":"'16-02-14'!$P20","v":0},{"$f":"'16-03-14'!$P20","v":0},{"$f":"'30-03-14'!$P20","v":0},{"$f":"'25-03-12'!$P20","v":0},null,null,null,null,9,9]
[9,"PURE BLONDE",{"$f":"'10-11-13'!$P23","v":10},{"$f":"'15-12-13'!$P23","v":0},{"$f":"'12-01-14'!$P23","v":0},{"$f":"'19-01-14'!$P23","v":0},{"$f":"'26-01-14'!$P23","v":0},{"$f":"'2-02-14'!$P23","v":0},{"$f":"'9-02-14'!$P23","v":0},{"$f":"'16-02-14'!$P23","v":0},{"$f":"'16-03-14'!$P23","v":0},{"$f":"'30-03-14'!$P23","v":0},{"$f":"'25-03-12'!$P23","v":0},null,null,null,null,10,10]
[3,"ASKO APPLIANCES",{"$f":"'10-11-13'!$P17","v":11},{"$f":"'15-12-13'!$P17","v":0},{"$f":"'12-01-14'!$P17","v":0},{"$f":"'19-01-14'!$P17","v":0},{"$f":"'26-01-14'!$P17","v":0},{"$f":"'2-02-14'!$P17","v":0},{"$f":"'9-02-14'!$P17","v":0},{"$f":"'16-02-14'!$P17","v":0},{"$f":"'16-03-14'!$P17","v":0},{"$f":"'30-03-14'!$P17","v":0},{"$f":"'25-03-12'!$P17","v":0},null,null,null,null,11,11]
[2,"YANDOO",{"$f":"'10-11-13'!$P16","v":12},{"$f":"'15-12-13'!$P16","v":0},{"$f":"'12-01-14'!$P16","v":0},{"$f":"'19-01-14'!$P16","v":0},{"$f":"'26-01-14'!$P16","v":0},{"$f":"'2-02-14'!$P16","v":0},{"$f":"'9-02-14'!$P16","v":0},{"$f":"'16-02-14'!$P16","v":0},{"$f":"'16-03-14'!$P16","v":0},{"$f":"'30-03-14'!$P16","v":0},{"$f":"'25-03-12'!$P16","v":0},null,null,null,null,12,12]
[4,"DE’LONGHI-RABBITOHS",{"$f":"'10-11-13'!$P18","v":13},{"$f":"'15-12-13'!$P18","v":0},{"$f":"'12-01-14'!$P18","v":0},{"$f":"'19-01-14'!$P18","v":0},{"$f":"'26-01-14'!$P18","v":0},{"$f":"'2-02-14'!$P18","v":0},{"$f":"'9-02-14'!$P18","v":0},{"$f":"'16-02-14'!$P18","v":0},{"$f":"'16-03-14'!$P18","v":0},{"$f":"'30-03-14'!$P18","v":0},{"$f":"'25-03-12'!$P18","v":0},null,null,null,null,13,13]
[14,"THE KITCHEN MAKER",{"$f":"'10-11-13'!$P28","v":14},{"$f":"'15-12-13'!$P28","v":0},{"$f":"'12-01-14'!$P28","v":0},{"$f":"'19-01-14'!$P28","v":0},{"$f":"'26-01-14'!$P28","v":0},{"$f":"'2-02-14'!$P28","v":0},{"$f":"'9-02-14'!$P28","v":0},{"$f":"'16-02-14'!$P28","v":0},{"$f":"'16-03-14'!$P28","v":0},{"$f":"'30-03-14'!$P28","v":0},{"$f":"'25-03-12'!$P28","v":0},null,null,null,null,14,14]
[15,"HAIER APPLIANCES",{"$f":"'10-11-13'!$P29","v":15},{"$f":"'15-12-13'!$P29","v":0},{"$f":"'12-01-14'!$P29","v":0},{"$f":"'19-01-14'!$P29","v":0},{"$f":"'26-01-14'!$P29","v":0},{"$f":"'2-02-14'!$P29","v":0},{"$f":"'9-02-14'!$P29","v":0},{"$f":"'16-02-14'!$P29","v":0},{"$f":"'16-03-14'!$P29","v":0},{"$f":"'30-03-14'!$P29","v":0},{"$f":"'25-03-12'!$P29","v":0},null,null,null,null,15,15]
[17,"COMPASSFOREX.COM.AU",{"$f":"'10-11-13'!$P31","v":16},{"$f":"'15-12-13'!$P31","v":0},{"$f":"'12-01-14'!$P31","v":0},{"$f":"'19-01-14'!$P31","v":0},{"$f":"'26-01-14'!$P31","v":0},{"$f":"'2-02-14'!$P31","v":0},{"$f":"'9-02-14'!$P31","v":0},{"$f":"'16-02-14'!$P31","v":0},{"$f":"'16-03-14'!$P31","v":0},{"$f":"'30-03-14'!$P31","v":0},{"$f":"'25-03-12'!$P31","v":0},null,null,null,null,16,16]
[11,"MOJO WINE",{"$f":"'10-11-13'!$P25","v":20},{"$f":"'15-12-13'!$P25","v":0},{"$f":"'12-01-14'!$P25","v":0},{"$f":"'19-01-14'!$P25","v":0},{"$f":"'26-01-14'!$P25","v":0},{"$f":"'2-02-14'!$P25","v":0},{"$f":"'9-02-14'!$P25","v":0},{"$f":"'16-02-14'!$P25","v":0},{"$f":"'16-03-14'!$P25","v":0},{"$f":"'30-03-14'!$P25","v":0},{"$f":"'25-03-12'!$P25","v":0},null,null,null,null,20,17]
[18,"VIAGOGO",{"$f":"'10-11-13'!$P32","v":20},{"$f":"'15-12-13'!$P32","v":0},{"$f":"'12-01-14'!$P32","v":0},{"$f":"'19-01-14'!$P32","v":0},{"$f":"'26-01-14'!$P32","v":0},{"$f":"'2-02-14'!$P32","v":0},{"$f":"'9-02-14'!$P32","v":0},{"$f":"'16-02-14'!$P32","v":0},{"$f":"'16-03-14'!$P32","v":0},{"$f":"'30-03-14'!$P32","v":0},{"$f":"'25-03-12'!$P32","v":0},null,null,null,null,20,{"$f":"S20+1","v":18}]
[19,"SOUTHERN CROSS",{"$f":"'10-11-13'!$P33","v":20},{"$f":"'15-12-13'!$P33","v":0},{"$f":"'12-01-14'!$P33","v":0},{"$f":"'19-01-14'!$P33","v":0},{"$f":"'26-01-14'!$P33","v":0},{"$f":"'2-02-14'!$P33","v":0},{"$f":"'9-02-14'!$P33","v":0},{"$f":"'16-02-14'!$P33","v":0},{"$f":"'16-03-14'!$P33","v":0},{"$f":"'30-03-14'!$P33","v":0},{"$f":"'25-03-12'!$P33","v":0},null,null,null,null,20,19]
[21,null,{"$f":"'3-11-13'!$P35","v":0},{"$f":"'10-11-13'!$P35","v":20},{"$f":"'17-11-13'!$P35","v":20},{"$f":"'24-11-13'!$P35","v":20},{"$f":"'1-12-13'!$P35","v":20},{"$f":"'8-12-13'!$P35","v":0},{"$f":"'12-01-14'!$P35","v":0},{"$f":"'19-01-14'!$P35","v":0},{"$f":"'26-01-14'!$P35","v":0},{"$f":"'2-02-14'!$P35","v":0},{"$f":"'9-02-14'!$P35","v":0},{"$f":"'23-02-14'!$P35","v":0},{"$f":"'16-03-14'!$P35","v":0},{"$f":"'30-03-14'!$P35","v":0},{"$f":"'18-03-12'!$P35","v":0},null,20]
[22,null,{"$f":"'3-11-13'!$P36","v":0},{"$f":"'10-11-13'!$P36","v":20},{"$f":"'17-11-13'!$P36","v":20},{"$f":"'24-11-13'!$P36","v":20},{"$f":"'1-12-13'!$P36","v":20},{"$f":"'8-12-13'!$P36","v":0},{"$f":"'12-01-14'!$P36","v":0},{"$f":"'19-01-14'!$P36","v":0},{"$f":"'26-01-14'!$P36","v":0},{"$f":"'2-02-14'!$P36","v":0},{"$f":"'9-02-14'!$P36","v":0},{"$f":"'23-02-14'!$P36","v":0},{"$f":"'16-03-14'!$P36","v":0},{"$f":"'30-03-14'!$P36","v":0},{"$f":"'18-03-12'!$P36","v":0},null,21]
[23,null,{"$f":"'3-11-13'!$P37","v":0},{"$f":"'10-11-13'!$P37","v":20},{"$f":"'17-11-13'!$P37","v":20},{"$f":"'24-11-13'!$P37","v":20},{"$f":"'1-12-13'!$P37","v":20},{"$f":"'8-12-13'!$P37","v":0},{"$f":"'12-01-14'!$P37","v":0},{"$f":"'19-01-14'!$P37","v":0},{"$f":"'26-01-14'!$P37","v":0},{"$f":"'2-02-14'!$P37","v":0},{"$f":"'9-02-14'!$P37","v":0},{"$f":"'23-02-14'!$P37","v":0},{"$f":"'16-03-14'!$P37","v":0},{"$f":"'30-03-14'!$P37","v":0},{"$f":"'18-03-12'!$P37","v":0},null,22]
[null,null,null,null,null,null,null,null,null,null,null,null,null,null,null,null,null,null,23]
["Notes:","YANDO, Fisher & Paykel receive Av points  for Race 1, based on other their 5 best results. Boats still in transit at time."]
[]
[]
[]
[]
["AUSTRALIAN 18Ft League - 2013/14 Season Handicap Point Score"]
[null,null,{"$f":"'13-10-13'!G4","v":"2013-10-13"},{"$f":"'20-10-13'!G4","v":"2013-10-20"},{"$f":"'27-10-13'!$G4","v":"2013-10-27"},{"$f":"'3-11-13'!$G4","v":"2013-11-03"},{"$f":"'10-11-13'!$G4","v":"2013-11-10"},{"$f":"'17-11-13'!$G4","v":"2013-11-17"},{"$f":"'24-11-13'!$G4","v":"2013-11-24"},{"$f":"'1-12-13'!$G4","v":"2013-12-01"},{"$f":"'8-12-13'!$G4","v":"2013-12-08"},{"$f":"'15-12-13'!$G4","v":"2013-12-15"},{"$f":"'12-01-14'!$G4","v":"2014-01-12"},{"$f":"'19-01-14'!$G4","v":"2014-01-19"},{"$f":"'26-01-14'!$G4","v":"2014-01-26"},{"$f":"'2-02-14'!$G4","v":"2014-02-02"},{"$f":"'9-02-14'!$G4","v":"2014-02-09"},{"$f":"'16-02-14'!$G4","v":"2014-02-16"},{"$f":"'23-02-14'!$G4","v":"2014-03-16"},{"$f":"'16-03-14'!$G4","v":"2014-02-23"},{"$f":"'23-03-14'!$G4","v":"2014-03-23"},{"$f":"'30-03-14'!$G4","v":"2014-03-30"},{"$f":"'11-03-12'!$G4","v":"00:00:00"},{"$f":"'18-03-12'!$G4","v":"00:00:00"},{"$f":"'25-03-12'!$G4","v":"00:00:00"}]
["Recall","Name","R1","R2","R3","R4","R5","R6","R7","R8","R9","R10","R11","R12","R13","R14","R15","R16","R17","T1","R19","R20","R21","R22","R23","Total","POS"]
[13,"RABBITOHS-KENWOOD",{"$f":"'13-10-13'!Q27","v":2},{"$f":"'20-10-13'!Q27","v":10},{"$f":"'27-10-13'!$Q27","v":5},{"$f":"'3-11-13'!$Q27","v":0},{"$f":"'10-11-13'!$Q27","v":1},{"$f":"'17-11-13'!$Q27","v":13},{"$f":"'24-11-13'!$Q27","v":1},{"$f":"'1-12-13'!$Q27","v":5},{"$f":"'8-12-13'!$Q27","v":0},{"$f":"'15-12-13'!$Q27","v":0},{"$f":"'12-01-14'!$Q27","v":0},{"$f":"'19-01-14'!$Q27","v":0},{"$f":"'26-01-14'!$Q27","v":0},{"$f":"'2-02-14'!$Q27","v":0},{"$f":"'9-02-14'!$Q27","v":0},{"$f":"'16-02-14'!$Q27","v":0},{"$f":"'23-02-14'!$Q27","v":0},{"$f":"'16-03-14'!$Q27","v":0},{"$f":"'23-03-14'!$Q27","v":0},{"$f":"'30-03-14'!$Q27","v":0},{"$f":"'11-03-12'!$Q27","v":0},{"$f":"'18-03-12'!$Q27","v":0},{"$f":"'25-03-12'!$Q27","v":0},{"$f":"SUM(C35:Y35)","v":37},1]
[1,"THURLOW FISHER LAWYERS",{"$f":"'13-10-13'!Q15","v":20},{"$f":"'20-10-13'!Q15","v":7},{"$f":"'27-10-13'!$Q15","v":4},{"$f":"'3-11-13'!$Q15","v":0},{"$f":"'10-11-13'!$Q15","v":4},{"$f":"'17-11-13'!$Q15","v":1},{"$f":"'24-11-13'!$Q15","v":4},{"$f":"'1-12-13'!$Q15","v":9},{"$f":"'8-12-13'!$Q15","v":0},{"$f":"'15-12-13'!$Q15","v":0},{"$f":"'12-01-14'!$Q15","v":0},{"$f":"'19-01-14'!$Q15","v":0},{"$f":"'26-01-14'!$Q15","v":0},{"$f":"'2-02-14'!$Q15","v":0},{"$f":"'9-02-14'!$Q15","v":0},{"$f":"'16-02-14'!$Q15","v":0},{"$f":"'23-02-14'!$Q15","v":0},{"$f":"'16-03-14'!$Q15","v":0},{"$f":"'23-03-14'!$Q15","v":0},{"$f":"'30-03-14'!$Q15","v":0},{"$f":"'11-03-12'!$Q15","v":0},{"$f":"'18-03-12'!$Q15","v":0},{"$f":"'25-03-12'!$Q15","v":0},49,2]
[8,"SMEG",{"$f":"'13-10-13'!Q22","v":1},{"$f":"'20-10-13'!Q22","v":11},{"$f":"'27-10-13'!$Q22","v":2},{"$f":"'3-11-13'!$Q22","v":0},{"$f":"'10-11-13'!$Q22","v":10},{"$f":"'17-11-13'!$Q22","v":12},{"$f":"'24-11-13'!$Q22","v":7},{"$f":"'1-12-13'!$Q22","v":8},{"$f":"'8-12-13'!$Q22","v":0},{"$f":"'15-12-13'!$Q22","v":0},{"$f":"'12-01-14'!$Q22","v":0},{"$f":"'19-01-14'!$Q22","v":0},{"$f":"'26-01-14'!$Q22","v":0},{"$f":"'2-02-14'!$Q22","v":0},{"$f":"'9-02-14'!$Q22","v":0},{"$f":"'16-02-14'!$Q22","v":0},{"$f":"'23-02-14'!$Q22","v":0},{"$f":"'16-03-14'!$Q22","v":0},{"$f":"'23-03-14'!$Q22","v":0},{"$f":"'30-03-14'!$Q22","v":0},{"$f":"'11-03-12'!$Q22","v":0},{"$f":"'18-03-12'!$Q22","v":0},{"$f":"'25-03-12'!$Q22","v":0},51,3]
[2,"YANDOO",{"$f":"'13-10-13'!Q16","v":20},{"$f":"'20-10-13'!Q16","v":2},{"$f":"'27-10-13'!$Q16","v":6},{"$f":"'3-11-13'!$Q16","v":0},{"$f":"'10-11-13'!$Q16","v":13},{"$f":"'17-11-13'!$Q16","v":5},{"$f":"'24-11-13'!$Q16","v":6},{"$f":"'1-12-13'!$Q16","v":7},{"$f":"'8-12-13'!$Q16","v":0},{"$f":"'15-12-13'!$Q16","v":0},{"$f":"'12-01-14'!$Q16","v":0},{"$f":"'19-01-14'!$Q16","v":0},{"$f":"'26-01-14'!$Q16","v":0},{"$f":"'2-02-14'!$Q16","v":0},{"$f":"'9-02-14'!$Q16","v":0},{"$f":"'16-02-14'!$Q16","v":0},{"$f":"'23-02-14'!$Q16","v":0},{"$f":"'16-03-14'!$Q16","v":0},{"$f":"'23-03-14'!$Q16","v":0},{"$f":"'30-03-14'!$Q16","v":0},{"$f":"'11-03-12'!$Q16","v":0},{"$f":"'18-03-12'!$Q16","v":0},{"$f":"'25-03-12'!$Q16","v":0},59,4]
[12,"LUMIX",{"$f":"'13-10-13'!Q26","v":20},{"$f":"'20-10-13'!Q26","v":1},{"$f":"'27-10-13'!$Q26","v":1},{"$f":"'3-11-13'!$Q26","v":0},{"$f":"'10-11-13'!$Q26","v":7},{"$f":"'17-11-13'!$Q26","v":3},{"$f":"'24-11-13'!$Q26","v":20},{"$f":"'1-12-13'!$Q26","v":11},{"$f":"'8-12-13'!$Q26","v":0},{"$f":"'15-12-13'!$Q26","v":0},{"$f":"'12-01-14'!$Q26","v":0},{"$f":"'19-01-14'!$Q26","v":0},{"$f":"'26-01-14'!$Q26","v":0},{"$f":"'2-02-14'!$Q26","v":0},{"$f":"'9-02-14'!$Q26","v":0},{"$f":"'16-02-14'!$Q26","v":0},{"$f":"'23-02-14'!$Q26","v":0},{"$f":"'16-03-14'!$Q26","v":0},{"$f":"'23-03-14'!$Q26","v":0},{"$f":"'30-03-14'!$Q26","v":0},{"$f":"'11-03-12'!$Q26","v":0},{"$f":"'18-03-12'!$Q26","v":0},{"$f":"'25-03-12'!$Q26","v":0},63,5]
[11,"MOJO WINE",{"$f":"'13-10-13'!Q25","v":20},{"$f":"'20-10-13'!Q25","v":3},{"$f":"'27-10-13'!$Q25","v":7},{"$f":"'3-11-13'!$Q25","v":0},{"$f":"'10-11-13'!$Q25","v":20},{"$f":"'17-11-13'!$Q25","v":8},{"$f":"'24-11-13'!$Q25","v":3},{"$f":"'1-12-13'!$Q25","v":2},{"$f":"'8-12-13'!$Q25","v":0},{"$f":"'15-12-13'!$Q25","v":0},{"$f":"'12-01-14'!$Q25","v":0},{"$f":"'19-01-14'!$Q25","v":0},{"$f":"'26-01-14'!$Q25","v":0},{"$f":"'2-02-14'!$Q25","v":0},{"$f":"'9-02-14'!$Q25","v":0},{"$f":"'16-02-14'!$Q25","v":0},{"$f":"'23-02-14'!$Q25","v":0},{"$f":"'16-03-14'!$Q25","v":0},{"$f":"'23-03-14'!$Q25","v":0},{"$f":"'30-03-14'!$Q25","v":0},{"$f":"'11-03-12'!$Q25","v":0},{"$f":"'18-03-12'!$Q25","v":0},{"$f":"'25-03-12'!$Q25","v":0},63,6]
[10,"FISHER & PAYKEL",{"$f":"'13-10-13'!Q24","v":20},{"$f":"'20-10-13'!Q24","v":9},{"$f":"'27-10-13'!$Q24","v":3},{"$f":"'3-11-13'!$Q24","v":0},{"$f":"'10-11-13'!$Q24","v":11},{"$f":"'17-11-13'!$Q24","v":7},{"$f":"'24-11-13'!$Q24","v":5},{"$f":"'1-12-13'!$Q24","v":13},{"$f":"'8-12-13'!$Q24","v":0},{"$f":"'15-12-13'!$Q24","v":0},{"$f":"'12-01-14'!$Q24","v":0},{"$f":"'19-01-14'!$Q24","v":0},{"$f":"'26-01-14'!$Q24","v":0},{"$f":"'2-02-14'!$Q24","v":0},{"$f":"'9-02-14'!$Q24","v":0},{"$f":"'16-02-14'!$Q24","v":0},{"$f":"'23-02-14'!$Q24","v":0},{"$f":"'16-03-14'!$Q24","v":0},{"$f":"'23-03-14'!$Q24","v":0},{"$f":"'30-03-14'!$Q24","v":0},{"$f":"'11-03-12'!$Q24","v":0},{"$f":"'18-03-12'!$Q24","v":0},{"$f":"'25-03-12'!$Q24","v":0},68,7,null,null,null,null,null,null,null,null,null,{"$f":"AI41+AJ41","v":0}]
[3,"ASKO APPLIANCES",{"$f":"'13-10-13'!Q17","v":20},{"$f":"'20-10-13'!Q17","v":4},{"$f":"'27-10-13'!$Q17","v":20},{"$f":"'3-11-13'!$Q17","v":0},{"$f":"'10-11-13'!$Q17","v":12},{"$f":"'17-11-13'!$Q17","v":11},{"$f":"'24-11-13'!$Q17","v":2},{"$f":"'1-12-13'!$Q17","v":4},{"$f":"'8-12-13'!$Q17","v":0},{"$f":"'15-12-13'!$Q17","v":0},{"$f":"'12-01-14'!$Q17","v":0},{"$f":"'19-01-14'!$Q17","v":0},{"$f":"'26-01-14'!$Q17","v":0},{"$f":"'2-02-14'!$Q17","v":0},{"$f":"'9-02-14'!$Q17","v":0},{"$f":"'16-02-14'!$Q17","v":0},{"$f":"'23-02-14'!$Q17","v":0},{"$f":"'16-03-14'!$Q17","v":0},{"$f":"'23-03-14'!$Q17","v":0},{"$f":"'30-03-14'!$Q17","v":0},{"$f":"'11-03-12'!$Q17","v":0},{"$f":"'18-03-12'!$Q17","v":0},{"$f":"'25-03-12'!$Q17","v":0},73,8,null,null,null,null,null,null,null,null,null,{"$f":"AI42+AJ42","v":0}]
[4,"DE’LONGHI-RABBITOHS",{"$f":"'13-10-13'!Q18","v":20},{"$f":"'20-10-13'!Q18","v":5},{"$f":"'27-10-13'!$Q18","v":9},{"$f":"'3-11-13'!$Q18","v":0},{"$f":"'10-11-13'!$Q18","v":8},{"$f":"'17-11-13'!$Q18","v":10},{"$f":"'24-11-13'!$Q18","v":13},{"$f":"'1-12-13'!$Q18","v":12},{"$f":"'8-12-13'!$Q18","v":0},{"$f":"'15-12-13'!$Q18","v":0},{"$f":"'12-01-14'!$Q18","v":0},{"$f":"'19-01-14'!$Q18","v":0},{"$f":"'26-01-14'!$Q18","v":0},{"$f":"'2-02-14'!$Q18","v":0},{"$f":"'9-02-14'!$Q18","v":0},{"$f":"'16-02-14'!$Q18","v":0},{"$f":"'23-02-14'!$Q18","v":0},{"$f":"'16-03-14'!$Q18","v":0},{"$f":"'23-03-14'!$Q18","v":0},{"$f":"'30-03-14'!$Q18","v":0},{"$f":"'11-03-12'!$Q18","v":0},{"$f":"'18-03-12'!$Q18","v":0},{"$f":"'25-03-12'!$Q18","v":0},77,9]
[14,"THE KITCHEN MAKER",{"$f":"'13-10-13'!Q28","v":20},{"$f":"'20-10-13'!Q28","v":6},{"$f":"'27-10-13'!$Q28","v":14},{"$f":"'3-11-13'!$Q28","v":0},{"$f":"'10-11-13'!$Q28","v":6},{"$f":"'17-11-13'!$Q28","v":4},{"$f":"'24-11-13'!$Q28","v":9},{"$f":"'1-12-13'!$Q28","v":20},{"$f":"'8-12-13'!$Q28","v":0},{"$f":"'15-12-13'!$Q28","v":0},{"$f":"'12-01-14'!$Q28","v":0},{"$f":"'19-01-14'!$Q28","v":0},{"$f":"'26-01-14'!$Q28","v":0},{"$f":"'2-02-14'!$Q28","v":0},{"$f":"'9-02-14'!$Q28","v":0},{"$f":"'16-02-14'!$Q28","v":0},{"$f":"'23-02-14'!$Q28","v":0},{"$f":"'16-03-14'!$Q28","v":0},{"$f":"'23-03-14'!$Q28","v":0},{"$f":"'30-03-14'!$Q28","v":0},{"$f":"'11-03-12'!$Q28","v":0},{"$f":"'18-03-12'!$Q28","v":0},{"$f":"'25-03-12'!$Q28","v":0},79,10]
[5,"APPLIANCESONLINE.COM.AU",{"$f":"'13-10-13'!Q19","v":20},{"$f":"'20-10-13'!Q19","v":20},{"$f":"'27-10-13'!$Q19","v":20},{"$f":"'3-11-13'!$Q19","v":0},{"$f":"'10-11-13'!$Q19","v":5},{"$f":"'17-11-13'!$Q19","v":2},{"$f":"'24-11-13'!$Q19","v":12},{"$f":"'1-12-13'!$Q19","v":6},{"$f":"'8-12-13'!$Q19","v":0},{"$f":"'15-12-13'!$Q19","v":0},{"$f":"'12-01-14'!$Q19","v":0},{"$f":"'19-01-14'!$Q19","v":0},{"$f":"'26-01-14'!$Q19","v":0},{"$f":"'2-02-14'!$Q19","v":0},{"$f":"'9-02-14'!$Q19","v":0},{"$f":"'16-02-14'!$Q19","v":0},{"$f":"'23-02-14'!$Q19","v":0},{"$f":"'16-03-14'!$Q19","v":0},{"$f":"'23-03-14'!$Q19","v":0},{"$f":"'30-03-14'!$Q19","v":0},{"$f":"'11-03-12'!$Q19","v":0},{"$f":"'18-03-12'!$Q19","v":0},{"$f":"'25-03-12'!$Q19","v":0},85,11]
[15,"HAIER APPLIANCES",{"$f":"'13-10-13'!Q29","v":20},{"$f":"'20-10-13'!Q29","v":12},{"$f":"'27-10-13'!$Q29","v":8},{"$f":"'3-11-13'!$Q29","v":0},{"$f":"'10-11-13'!$Q29","v":15},{"$f":"'17-11-13'!$Q29","v":9},{"$f":"'24-11-13'!$Q29","v":8},{"$f":"'1-12-13'!$Q29","v":16},{"$f":"'8-12-13'!$Q29","v":0},{"$f":"'15-12-13'!$Q29","v":0},{"$f":"'12-01-14'!$Q29","v":0},{"$f":"'19-01-14'!$Q29","v":0},{"$f":"'26-01-14'!$Q29","v":0},{"$f":"'2-02-14'!$Q29","v":0},{"$f":"'9-02-14'!$Q29","v":0},{"$f":"'16-02-14'!$Q29","v":0},{"$f":"'23-02-14'!$Q29","v":0},{"$f":"'16-03-14'!$Q29","v":0},{"$f":"'23-03-14'!$Q29","v":0},{"$f":"'30-03-14'!$Q29","v":0},{"$f":"'11-03-12'!$Q29","v":0},{"$f":"'18-03-12'!$Q29","v":0},{"$f":"'25-03-12'!$Q29","v":0},88,12]
[6,"COOPERS 62-RAG & FAMISH HOTEL",{"$f":"'13-10-13'!Q20","v":20},{"$f":"(C47+SUM(E47:V47))/(COUNTIF(E47:V47,\">0\")+1)","v":13.5},{"$f":"'27-10-13'!$Q20","v":20},{"$f":"'3-11-13'!$Q20","v":0},{"$f":"'10-11-13'!$Q20","v":14},{"$f":"'17-11-13'!$Q20","v":6},{"$f":"'24-11-13'!$Q20","v":20},{"$f":"'1-12-13'!$Q20","v":1},{"$f":"'8-12-13'!$Q20","v":0},{"$f":"'15-12-13'!$Q20","v":0},{"$f":"'12-01-14'!$Q20","v":0},{"$f":"'19-01-14'!$Q20","v":0},{"$f":"'26-01-14'!$Q20","v":0},{"$f":"'2-02-14'!$Q20","v":0},{"$f":"'9-02-14'!$Q20","v":0},{"$f":"'16-02-14'!$Q20","v":0},{"$f":"'23-02-14'!$Q20","v":0},{"$f":"'16-03-14'!$Q20","v":0},{"$f":"'23-03-14'!$Q20","v":0},{"$f":"'30-03-14'!$Q20","v":0},{"$f":"'11-03-12'!$Q20","v":0},{"$f":"'18-03-12'!$Q20","v":0},{"$f":"'25-03-12'!$Q20","v":0},94.5,13]
[16,"SYDNEY CITY MARINE",{"$f":"'13-10-13'!Q30","v":20},{"$f":"'20-10-13'!Q30","v":13},{"$f":"'27-10-13'!$Q30","v":20},{"$f":"'3-11-13'!$Q30","v":0},{"$f":"'10-11-13'!$Q30","v":9},{"$f":"'17-11-13'!$Q30","v":20},{"$f":"'24-11-13'!$Q30","v":10},{"$f":"'1-12-13'!$Q30","v":3},{"$f":"'8-12-13'!$Q30","v":0},{"$f":"'15-12-13'!$Q30","v":0},{"$f":"'12-01-14'!$Q30","v":0},{"$f":"'19-01-14'!$Q30","v":0},{"$f":"'26-01-14'!$Q30","v":0},{"$f":"'2-02-14'!$Q30","v":0},{"$f":"'9-02-14'!$Q30","v":0},{"$f":"'16-02-14'!$Q30","v":0},{"$f":"'23-02-14'!$Q30","v":0},{"$f":"'16-03-14'!$Q30","v":0},{"$f":"'23-03-14'!$Q30","v":0},{"$f":"'30-03-14'!$Q30","v":0},{"$f":"'11-03-12'!$Q30","v":0},{"$f":"'18-03-12'!$Q30","v":0},{"$f":"'25-03-12'!$Q30","v":0},95,14]
[9,"PURE BLONDE",{"$f":"'13-10-13'!Q23","v":20},{"$f":"'20-10-13'!Q23","v":8},{"$f":"'27-10-13'!$Q23","v":10},{"$f":"'3-11-13'!$Q23","v":0},{"$f":"'10-11-13'!$Q23","v":2},{"$f":"'17-11-13'!$Q23","v":20},{"$f":"'24-11-13'!$Q23","v":20},{"$f":"'1-12-13'!$Q23","v":20},{"$f":"'8-12-13'!$Q23","v":0},{"$f":"'15-12-13'!$Q23","v":0},{"$f":"'12-01-14'!$Q23","v":0},{"$f":"'19-01-14'!$Q23","v":0},{"$f":"'26-01-14'!$Q23","v":0},{"$f":"'2-02-14'!$Q23","v":0},{"$f":"'9-02-14'!$Q23","v":0},{"$f":"'16-02-14'!$Q23","v":0},{"$f":"'23-02-14'!$Q23","v":0},{"$f":"'16-03-14'!$Q23","v":0},{"$f":"'23-03-14'!$Q23","v":0},{"$f":"'30-03-14'!$Q23","v":0},{"$f":"'11-03-12'!$Q23","v":0},{"$f":"'18-03-12'!$Q23","v":0},{"$f":"'25-03-12'!$Q23","v":0},100,15]
[19,"SOUTHERN CROSS",{"$f":"'13-10-13'!Q33","v":20},{"$f":"'20-10-13'!Q33","v":14},{"$f":"'27-10-13'!$Q33","v":12},{"$f":"'3-11-13'!$Q33","v":0},{"$f":"'10-11-13'!$Q33","v":20},{"$f":"'17-11-13'!$Q33","v":14},{"$f":"'24-11-13'!$Q33","v":14},{"$f":"'1-12-13'!$Q33","v":10},{"$f":"'8-12-13'!$Q33","v":0},{"$f":"'15-12-13'!$Q33","v":0},{"$f":"'12-01-14'!$Q33","v":0},{"$f":"'19-01-14'!$Q33","v":0},{"$f":"'26-01-14'!$Q33","v":0},{"$f":"'2-02-14'!$Q33","v":0},{"$f":"'9-02-14'!$Q33","v":0},{"$f":"'16-02-14'!$Q33","v":0},{"$f":"'23-02-14'!$Q33","v":0},{"$f":"'16-03-14'!$Q33","v":0},{"$f":"'23-03-14'!$Q33","v":0},{"$f":"'30-03-14'!$Q33","v":0},{"$f":"'11-03-12'!$Q33","v":0},{"$f":"'18-03-12'!$Q33","v":0},{"$f":"'25-03-12'!$Q33","v":0},104,16]
[17,"COMPASSFOREX.COM.AU",{"$f":"'13-10-13'!Q31","v":20},{"$f":"'20-10-13'!Q31","v":15},{"$f":"'27-10-13'!$Q31","v":11},{"$f":"'3-11-13'!$Q31","v":0},{"$f":"'10-11-13'!$Q31","v":16},{"$f":"'17-11-13'!$Q31","v":15},{"$f":"'24-11-13'!$Q31","v":15},{"$f":"'1-12-13'!$Q31","v":14},{"$f":"'8-12-13'!$Q31","v":0},{"$f":"'15-12-13'!$Q31","v":0},{"$f":"'12-01-14'!$Q31","v":0},{"$f":"'19-01-14'!$Q31","v":0},{"$f":"'26-01-14'!$Q31","v":0},{"$f":"'2-02-14'!$Q31","v":0},{"$f":"'9-02-14'!$Q31","v":0},{"$f":"'16-02-14'!$Q31","v":0},{"$f":"'23-02-14'!$Q31","v":0},{"$f":"'16-03-14'!$Q31","v":0},{"$f":"'23-03-14'!$Q31","v":0},{"$f":"'30-03-14'!$Q31","v":0},{"$f":"'11-03-12'!$Q31","v":0},{"$f":"'18-03-12'!$Q31","v":0},{"$f":"'25-03-12'!$Q31","v":0},106,17]
[7,"GOTTA LOVE IT 7",{"$f":"'13-10-13'!Q21","v":20},{"$f":"'20-10-13'!Q21","v":20},{"$f":"'27-10-13'!$Q21","v":20},{"$f":"'3-11-13'!$Q21","v":0},{"$f":"'10-11-13'!$Q21","v":3},{"$f":"'17-11-13'!$Q21","v":20},{"$f":"'24-11-13'!$Q21","v":11},{"$f":"'1-12-13'!$Q21","v":15},{"$f":"'8-12-13'!$Q21","v":0},{"$f":"'15-12-13'!$Q21","v":0},{"$f":"'12-01-14'!$Q21","v":0},{"$f":"'19-01-14'!$Q21","v":0},{"$f":"'26-01-14'!$Q21","v":0},{"$f":"'2-02-14'!$Q21","v":0},{"$f":"'9-02-14'!$Q21","v":0},{"$f":"'16-02-14'!$Q21","v":0},{"$f":"'23-02-14'!$Q21","v":0},{"$f":"'16-03-14'!$Q21","v":0},{"$f":"'23-03-14'!$Q21","v":0},{"$f":"'30-03-14'!$Q21","v":0},{"$f":"'11-03-12'!$Q21","v":0},{"$f":"'18-03-12'!$Q21","v":0},{"$f":"'25-03-12'!$Q21","v":0},109,18]
[18,"VIAGOGO",{"$f":"'13-10-13'!Q32","v":20},{"$f":"'20-10-13'!Q32","v":20},{"$f":"'27-10-13'!$Q32","v":13},{"$f":"'3-11-13'!$Q32","v":0},{"$f":"'10-11-13'!$Q32","v":20},{"$f":"'17-11-13'!$Q32","v":20},{"$f":"'24-11-13'!$Q32","v":20},{"$f":"'1-12-13'!$Q32","v":17},{"$f":"'8-12-13'!$Q32","v":0},{"$f":"'15-12-13'!$Q32","v":0},{"$f":"'12-01-14'!$Q32","v":0},{"$f":"'19-01-14'!$Q32","v":0},{"$f":"'26-01-14'!$Q32","v":0},{"$f":"'2-02-14'!$Q32","v":0},{"$f":"'9-02-14'!$Q32","v":0},{"$f":"'16-02-14'!$Q32","v":0},{"$f":"'23-02-14'!$Q32","v":0},{"$f":"'16-03-14'!$Q32","v":0},{"$f":"'23-03-14'!$Q32","v":0},{"$f":"'30-03-14'!$Q32","v":0},{"$f":"'11-03-12'!$Q32","v":0},{"$f":"'18-03-12'!$Q32","v":0},{"$f":"'25-03-12'!$Q32","v":0},130,19,null,null,null,null,null,null,null,"NB These cells have white forground to hide data"]
[22,null,{"$f":"'13-10-13'!Q36","v":20},{"$f":"'20-10-13'!Q36","v":20},{"$f":"'27-10-13'!$Q36","v":20},{"$f":"'3-11-13'!$Q36","v":0},{"$f":"'10-11-13'!$Q36","v":20},{"$f":"'17-11-13'!$Q36","v":20},{"$f":"'24-11-13'!$Q37","v":20},{"$f":"'1-12-13'!$Q37","v":20},{"$f":"'8-12-13'!$Q37","v":0},{"$f":"'15-12-13'!$Q37","v":0},{"$f":"'12-01-14'!$Q37","v":0},{"$f":"'19-01-14'!$Q37","v":0},{"$f":"'26-01-14'!$Q37","v":0},{"$f":"'2-02-14'!$Q37","v":0},{"$f":"'9-02-14'!$Q37","v":0},{"$f":"'16-02-14'!$Q37","v":0},{"$f":"'23-02-14'!$Q37","v":0},{"$f":"'16-03-14'!$Q37","v":0},{"$f":"'23-03-14'!$Q37","v":0},{"$f":"'30-03-14'!$Q37","v":0},{"$f":"'11-03-12'!$Q37","v":0},{"$f":"'18-03-12'!$Q37","v":0},{"$f":"'25-03-12'!$Q28","v":0},null,20]
[23,null,{"$f":"'13-10-13'!Q35","v":20},{"$f":"'20-10-13'!Q35","v":20},{"$f":"'27-10-13'!$Q35","v":20},{"$f":"'3-11-13'!$Q35","v":0},{"$f":"'10-11-13'!$Q35","v":20},{"$f":"'17-11-13'!$Q35","v":20},{"$f":"'24-11-13'!$Q36","v":20},{"$f":"'1-12-13'!$Q36","v":20},{"$f":"'8-12-13'!$Q36","v":0},{"$f":"'15-12-13'!$Q36","v":0},{"$f":"'12-01-14'!$Q36","v":0},{"$f":"'19-01-14'!$Q36","v":0},{"$f":"'26-01-14'!$Q36","v":0},{"$f":"'2-02-14'!$Q36","v":0},{"$f":"'9-02-14'!$Q36","v":0},{"$f":"'16-02-14'!$Q36","v":0},{"$f":"'23-02-14'!$Q36","v":0},{"$f":"'16-03-14'!$Q36","v":0},{"$f":"'23-03-14'!$Q36","v":0},{"$f":"'30-03-14'!$Q36","v":0},{"$f":"'11-03-12'!$Q36","v":0},{"$f":"'18-03-12'!$Q36","v":0},{"$f":"'25-03-12'!$Q37","v":0},null,21]
[null,null,null,null,null,null,null,null,null,null,null,null,null,null,null,null,null,null,null,null,null,null,null,null,null,null,22]
[null,null,null,null,null,null,{"$f":"'10-11-13'!$Q32","v":20},{"$f":"'17-11-13'!$Q32","v":20},{"$f":"'24-11-13'!$Q32","v":20},{"$f":"'1-12-13'!$Q32","v":17},{"$f":"'8-12-13'!$Q32","v":0},{"$f":"'15-12-13'!$Q32","v":0},{"$f":"'12-01-14'!$Q32","v":0},{"$f":"'19-01-14'!$Q32","v":0},{"$f":"'26-01-14'!$Q32","v":0},{"$f":"'2-02-14'!$Q32","v":0},{"$f":"'9-02-14'!$Q32","v":0},{"$f":"'16-02-14'!$Q32","v":0},{"$f":"'23-02-14'!$Q32","v":0},{"$f":"'16-03-14'!$Q32","v":0},{"$f":"'23-03-14'!$Q32","v":0},{"$f":"'30-03-14'!$Q32","v":0},{"$f":"'11-03-12'!$Q32","v":0},{"$f":"'18-03-12'!$Q32","v":0},{"$f":"'25-03-12'!$Q38","v":0},null,23]
["Notes:"]
[]
[]
["AUSTRALIAN 18Ft League - 2013/14 - 3 Buoy Challenge Point Score"]
[null,null,{"$f":"'13-10-13'!G4","v":"2013-10-13"},{"$f":"'20-10-13'!$G4","v":"2013-10-20"},{"$f":"'27-10-13'!$G4","v":"2013-10-27"},{"$f":"'3-11-13'!$G4","v":"2013-11-03"},{"$f":"'17-11-13'!$G4","v":"2013-11-17"},{"$f":"'24-11-13'!$G4","v":"2013-11-24"},{"$f":"'1-12-13'!$G4","v":"2013-12-01"},{"$f":"'8-12-13'!$G4","v":"2013-12-08"},1,"Drop"]
["Recall","Name","R1","R2","R3","R4","R5","R6","R7","R8","Total","Total","POS"]
[13,"RABBITOHS-KENWOOD",{"$f":"IF('13-10-13'!Q27=20,20,'13-10-13'!Q27)","v":2},{"$f":"IF('20-10-13'!$Q27=20,20,'20-10-13'!$Q27)","v":10},{"$f":"IF('27-10-13'!$Q27=20,20,'27-10-13'!$Q27)","v":5},{"$f":"IF('3-11-13'!$Q27=20,20,'3-11-13'!$Q27)","v":0},{"$f":"IF('17-11-13'!$Q27=20,20,'17-11-13'!$Q27)","v":13},{"$f":"IF('24-11-13'!$Q27=20,20,'24-11-13'!$Q27)","v":1},{"$f":"IF('1-12-13'!$Q27=20,20,'1-12-13'!$Q27)","v":5},{"$f":"'8-12-13'!$Q27","v":0},{"$f":"SUM(C64:J64)","v":36},{"$f":"IF(K$62=1,SUM(C64:J64)-MAX(C64:J64),SUM(C64:J64))","v":23},1]
[11,"MOJO WINE",{"$f":"IF('13-10-13'!Q25=20,20,'13-10-13'!Q25)","v":20},{"$f":"IF('20-10-13'!$Q25=20,20,'20-10-13'!$Q25)","v":3},{"$f":"IF('27-10-13'!$Q25=20,20,'27-10-13'!$Q25)","v":7},{"$f":"IF('3-11-13'!$Q25=20,20,'3-11-13'!$Q25)","v":0},{"$f":"IF('17-11-13'!$Q25=20,20,'17-11-13'!$Q25)","v":8},{"$f":"IF('24-11-13'!$Q25=20,20,'24-11-13'!$Q25)","v":3},{"$f":"IF('1-12-13'!$Q25=20,20,'1-12-13'!$Q25)","v":2},{"$f":"'8-12-13'!$Q25","v":0},43,23,2]
[2,"YANDOO",{"$f":"(SUM(D66:J66)-MAX(D66:J66))/(COUNTIF(D66:J66,\">0\")-1)","v":4.75},{"$f":"IF('20-10-13'!$Q16=20,20,'20-10-13'!$Q16)","v":2},{"$f":"IF('27-10-13'!$Q16=20,20,'27-10-13'!$Q16)","v":6},{"$f":"IF('3-11-13'!$Q16=20,20,'3-11-13'!$Q16)","v":0},{"$f":"IF('17-11-13'!$Q16=20,20,'17-11-13'!$Q16)","v":5},{"$f":"IF('24-11-13'!$Q16=20,20,'24-11-13'!$Q16)","v":6},{"$f":"IF('1-12-13'!$Q16=20,20,'1-12-13'!$Q16)","v":7},{"$f":"'8-12-13'!$Q16","v":0},30.75,23.75,3]
[1,"THURLOW FISHER LAWYERS",{"$f":"IF('13-10-13'!Q15=20,20,'13-10-13'!Q15)","v":20},{"$f":"IF('20-10-13'!$Q15=20,20,'20-10-13'!$Q15)","v":7},{"$f":"IF('27-10-13'!$Q15=20,20,'27-10-13'!$Q15)","v":4},{"$f":"IF('3-11-13'!$Q15=20,20,'3-11-13'!$Q15)","v":0},{"$f":"IF('17-11-13'!$Q15=20,20,'17-11-13'!$Q15)","v":1},{"$f":"IF('24-11-13'!$Q15=20,20,'24-11-13'!$Q15)","v":4},{"$f":"IF('1-12-13'!$Q15=20,20,'1-12-13'!$Q15)","v":9},{"$f":"'8-12-13'!$Q15","v":0},45,25,4]
[8,"SMEG",{"$f":"IF('13-10-13'!Q22=20,20,'13-10-13'!Q22)","v":1},{"$f":"IF('20-10-13'!$Q22=20,20,'20-10-13'!$Q22)","v":11},{"$f":"IF('27-10-13'!$Q22=20,20,'27-10-13'!$Q22)","v":2},{"$f":"IF('3-11-13'!$Q22=20,20,'3-11-13'!$Q22)","v":0},{"$f":"IF('17-11-13'!$Q22=20,20,'17-11-13'!$Q22)","v":12},{"$f":"IF('24-11-13'!$Q22=20,20,'24-11-13'!$Q22)","v":7},{"$f":"IF('1-12-13'!$Q22=20,20,'1-12-13'!$Q22)","v":8},{"$f":"'8-12-13'!$Q22","v":0},41,29,5]
[10,"FISHER & PAYKEL",{"$f":"(SUM(D69:J69)-MAX(D69:J69))/(COUNTIF(D69:J69,\">0\")-1)","v":6},{"$f":"IF('20-10-13'!$Q24=20,20,'20-10-13'!$Q24)","v":9},{"$f":"IF('27-10-13'!$Q24=20,20,'27-10-13'!$Q24)","v":3},{"$f":"IF('3-11-13'!$Q24=20,20,'3-11-13'!$Q24)","v":0},{"$f":"IF('17-11-13'!$Q24=20,20,'17-11-13'!$Q24)","v":7},{"$f":"IF('24-11-13'!$Q24=20,20,'24-11-13'!$Q24)","v":5},{"$f":"IF('1-12-13'!$Q24=20,20,'1-12-13'!$Q24)","v":13},{"$f":"'8-12-13'!$Q24","v":0},43,30,6]
[12,"LUMIX",{"$f":"IF('13-10-13'!Q26=20,20,'13-10-13'!Q26)","v":20},{"$f":"IF('20-10-13'!$Q26=20,20,'20-10-13'!$Q26)","v":1},{"$f":"IF('27-10-13'!$Q26=20,20,'27-10-13'!$Q26)","v":1},{"$f":"IF('3-11-13'!$Q26=20,20,'3-11-13'!$Q26)","v":0},{"$f":"IF('17-11-13'!$Q26=20,20,'17-11-13'!$Q26)","v":3},{"$f":"IF('24-11-13'!$Q26=20,20,'24-11-13'!$Q26)","v":20},{"$f":"IF('1-12-13'!$Q26=20,20,'1-12-13'!$Q26)","v":11},{"$f":"'8-12-13'!$Q26","v":0},56,36,7]
[3,"ASKO APPLIANCES",{"$f":"IF('13-10-13'!Q17=20,20,'13-10-13'!Q17)","v":20},{"$f":"IF('20-10-13'!$Q17=20,20,'20-10-13'!$Q17)","v":4},{"$f":"IF('27-10-13'!$Q17=20,20,'27-10-13'!$Q17)","v":20},{"$f":"IF('3-11-13'!$Q17=20,20,'3-11-13'!$Q17)","v":0},{"$f":"IF('17-11-13'!$Q17=20,20,'17-11-13'!$Q17)","v":11},{"$f":"IF('24-11-13'!$Q17=20,20,'24-11-13'!$Q17)","v":2},{"$f":"IF('1-12-13'!$Q17=20,20,'1-12-13'!$Q17)","v":4},{"$f":"'8-12-13'!$Q17","v":0},61,41,8]
[4,"DE’LONGHI-RABBITOHS",{"$f":"IF('13-10-13'!Q18=20,20,'13-10-13'!Q18)","v":20},{"$f":"IF('20-10-13'!$Q18=20,20,'20-10-13'!$Q18)","v":5},{"$f":"IF('27-10-13'!$Q18=20,20,'27-10-13'!$Q18)","v":9},{"$f":"IF('3-11-13'!$Q18=20,20,'3-11-13'!$Q18)","v":0},{"$f":"IF('17-11-13'!$Q18=20,20,'17-11-13'!$Q18)","v":10},{"$f":"IF('24-11-13'!$Q18=20,20,'24-11-13'!$Q18)","v":13},{"$f":"IF('1-12-13'!$Q18=20,20,'1-12-13'!$Q18)","v":12},{"$f":"'8-12-13'!$Q18","v":0},69,49,9]
[14,"THE KITCHEN MAKER",{"$f":"IF('13-10-13'!Q28=20,20,'13-10-13'!Q28)","v":20},{"$f":"IF('20-10-13'!$Q28=20,20,'20-10-13'!$Q28)","v":6},{"$f":"IF('27-10-13'!$Q28=20,20,'27-10-13'!$Q28)","v":14},{"$f":"IF('3-11-13'!$Q28=20,20,'3-11-13'!$Q28)","v":0},{"$f":"IF('17-11-13'!$Q28=20,20,'17-11-13'!$Q28)","v":4},{"$f":"IF('24-11-13'!$Q28=20,20,'24-11-13'!$Q28)","v":9},{"$f":"IF('1-12-13'!$Q28=20,20,'1-12-13'!$Q28)","v":20},{"$f":"'8-12-13'!$Q28","v":0},73,53,10]
[15,"HAIER APPLIANCES",{"$f":"IF('13-10-13'!Q29=20,20,'13-10-13'!Q29)","v":20},{"$f":"IF('20-10-13'!$Q29=20,20,'20-10-13'!$Q29)","v":12},{"$f":"IF('27-10-13'!$Q29=20,20,'27-10-13'!$Q29)","v":8},{"$f":"IF('3-11-13'!$Q29=20,20,'3-11-13'!$Q29)","v":0},{"$f":"IF('17-11-13'!$Q29=20,20,'17-11-13'!$Q29)","v":9},{"$f":"IF('24-11-13'!$Q29=20,20,'24-11-13'!$Q29)","v":8},{"$f":"IF('1-12-13'!$Q29=20,20,'1-12-13'!$Q29)","v":16},{"$f":"'8-12-13'!$Q29","v":0},73,53,11]
[5,"APPLIANCESONLINE.COM.AU",{"$f":"IF('13-10-13'!Q19=20,20,'13-10-13'!Q19)","v":20},{"$f":"IF('20-10-13'!$Q19=20,20,'20-10-13'!$Q19)","v":20},{"$f":"IF('27-10-13'!$Q19=20,20,'27-10-13'!$Q19)","v":20},{"$f":"IF('3-11-13'!$Q19=20,20,'3-11-13'!$Q19)","v":0},{"$f":"IF('17-11-13'!$Q19=20,20,'17-11-13'!$Q19)","v":2},{"$f":"IF('24-11-13'!$Q19=20,20,'24-11-13'!$Q19)","v":12},{"$f":"IF('1-12-13'!$Q19=20,20,'1-12-13'!$Q19)","v":6},{"$f":"'8-12-13'!$Q19","v":0},80,60,12]
[19,"SOUTHERN CROSS",{"$f":"IF('13-10-13'!Q33=20,20,'13-10-13'!Q33)","v":20},{"$f":"IF('20-10-13'!$Q33=20,20,'20-10-13'!$Q33)","v":14},{"$f":"IF('27-10-13'!$Q33=20,20,'27-10-13'!$Q33)","v":12},{"$f":"IF('3-11-13'!$Q33=20,20,'3-11-13'!$Q33)","v":0},{"$f":"IF('17-11-13'!$Q33=20,20,'17-11-13'!$Q33)","v":14},{"$f":"IF('24-11-13'!$Q33=20,20,'24-11-13'!$Q33)","v":14},{"$f":"IF('1-12-13'!$Q33=20,20,'1-12-13'!$Q33)","v":10},{"$f":"'8-12-13'!$Q33","v":0},84,64,13]
[16,"SYDNEY CITY MARINE",{"$f":"IF('13-10-13'!Q30=20,20,'13-10-13'!Q30)","v":20},{"$f":"IF('20-10-13'!$Q30=20,20,'20-10-13'!$Q30)","v":13},{"$f":"IF('27-10-13'!$Q30=20,20,'27-10-13'!$Q30)","v":20},{"$f":"IF('3-11-13'!$Q30=20,20,'3-11-13'!$Q30)","v":0},{"$f":"IF('17-11-13'!$Q30=20,20,'17-11-13'!$Q30)","v":20},{"$f":"IF('24-11-13'!$Q30=20,20,'24-11-13'!$Q30)","v":10},{"$f":"IF('1-12-13'!$Q30=20,20,'1-12-13'!$Q30)","v":3},{"$f":"'8-12-13'!$Q30","v":0},86,66,14]
[6,"COOPERS 62-RAG & FAMISH HOTEL",{"$f":"IF('13-10-13'!Q20=20,20,'13-10-13'!Q20)","v":20},{"$f":"IF('20-10-13'!$Q20=20,20,'20-10-13'!$Q20)","v":20},{"$f":"IF('27-10-13'!$Q20=20,20,'27-10-13'!$Q20)","v":20},{"$f":"IF('3-11-13'!$Q20=20,20,'3-11-13'!$Q20)","v":0},{"$f":"IF('17-11-13'!$Q20=20,20,'17-11-13'!$Q20)","v":6},{"$f":"IF('24-11-13'!$Q20=20,20,'24-11-13'!$Q20)","v":20},{"$f":"IF('1-12-13'!$Q20=20,20,'1-12-13'!$Q20)","v":1},{"$f":"'8-12-13'!$Q20","v":0},87,67,15]
[17,"COMPASSFOREX.COM.AU",{"$f":"IF('13-10-13'!Q31=20,20,'13-10-13'!Q31)","v":20},{"$f":"IF('20-10-13'!$Q31=20,20,'20-10-13'!$Q31)","v":15},{"$f":"IF('27-10-13'!$Q31=20,20,'27-10-13'!$Q31)","v":11},{"$f":"IF('3-11-13'!$Q31=20,20,'3-11-13'!$Q31)","v":0},{"$f":"IF('17-11-13'!$Q31=20,20,'17-11-13'!$Q31)","v":15},{"$f":"IF('24-11-13'!$Q31=20,20,'24-11-13'!$Q31)","v":15},{"$f":"IF('1-12-13'!$Q31=20,20,'1-12-13'!$Q31)","v":14},{"$f":"'8-12-13'!$Q31","v":0},90,70,16]
[9,"PURE BLONDE",{"$f":"IF('13-10-13'!Q23=20,20,'13-10-13'!Q23)","v":20},{"$f":"IF('20-10-13'!$Q23=20,20,'20-10-13'!$Q23)","v":8},{"$f":"IF('27-10-13'!$Q23=20,20,'27-10-13'!$Q23)","v":10},{"$f":"IF('3-11-13'!$Q23=20,20,'3-11-13'!$Q23)","v":0},{"$f":"IF('17-11-13'!$Q23=20,20,'17-11-13'!$Q23)","v":20},{"$f":"IF('24-11-13'!$Q23=20,20,'24-11-13'!$Q23)","v":20},{"$f":"IF('1-12-13'!$Q23=20,20,'1-12-13'!$Q23)","v":20},{"$f":"'8-12-13'!$Q23","v":0},98,78,17]
[7,"GOTTA LOVE IT 7",{"$f":"IF('13-10-13'!Q21=20,20,'13-10-13'!Q21)","v":20},{"$f":"IF('20-10-13'!$Q21=20,20,'20-10-13'!$Q21)","v":20},{"$f":"IF('27-10-13'!$Q21=20,20,'27-10-13'!$Q21)","v":20},{"$f":"IF('3-11-13'!$Q21=20,20,'3-11-13'!$Q21)","v":0},{"$f":"IF('17-11-13'!$Q21=20,20,'17-11-13'!$Q21)","v":20},{"$f":"IF('24-11-13'!$Q21=20,20,'24-11-13'!$Q21)","v":11},{"$f":"IF('1-12-13'!$Q21=20,20,'1-12-13'!$Q21)","v":15},{"$f":"'8-12-13'!$Q21","v":0},106,86,18]
[18,"VIAGOGO",{"$f":"IF('13-10-13'!Q32=20,20,'13-10-13'!Q32)","v":20},{"$f":"IF('20-10-13'!$Q32=20,20,'20-10-13'!$Q32)","v":20},{"$f":"IF('27-10-13'!$Q32=20,20,'27-10-13'!$Q32)","v":13},{"$f":"IF('3-11-13'!$Q32=20,20,'3-11-13'!$Q32)","v":0},{"$f":"IF('17-11-13'!$Q32=20,20,'17-11-13'!$Q32)","v":20},{"$f":"IF('24-11-13'!$Q32=20,20,'24-11-13'!$Q32)","v":20},{"$f":"IF('1-12-13'!$Q32=20,20,'1-12-13'!$Q32)","v":17},{"$f":"'8-12-13'!$Q32","v":0},110,90,19]
[20,null,{"$f":"'20-10-13'!Q63","v":0},{"$f":"'27-10-13'!$Q63","v":0},{"$f":"'3-11-13'!$Q63","v":0},{"$f":"'10-11-13'!$Q63","v":0},{"$f":"'17-11-13'!$Q63","v":0},{"$f":"'10-11-13'!$Q63","v":0},{"$f":"'17-11-13'!$Q63","v":0},{"$f":"'15-12-13'!$Q34","v":0},{"$f":"SUM(F83:J83)","v":0},null,20]
[22,null,{"$f":"'20-10-13'!Q65","v":0},{"$f":"'27-10-13'!$Q65","v":0},{"$f":"'3-11-13'!$Q65","v":0},{"$f":"'10-11-13'!$Q65","v":0},{"$f":"'17-11-13'!$Q65","v":0},{"$f":"'10-11-13'!$Q65","v":0},{"$f":"'17-11-13'!$Q65","v":0},{"$f":"'15-12-13'!$Q35","v":0},{"$f":"SUM(F84:J84)","v":0},null,21]
[23,null,{"$f":"'20-10-13'!Q64","v":0},{"$f":"'27-10-13'!$Q64","v":0},{"$f":"'3-11-13'!$Q64","v":0},{"$f":"'10-11-13'!$Q64","v":0},{"$f":"'17-11-13'!$Q64","v":0},{"$f":"'10-11-13'!$Q64","v":0},{"$f":"'17-11-13'!$Q64","v":0},{"$f":"'15-12-13'!$Q36","v":0},{"$f":"SUM(F85:J85)","v":0},null,22]
[null,null,null,null,null,{"$f":"'10-11-13'!$Q61","v":0},{"$f":"'17-11-13'!$Q61","v":0},{"$f":"'10-11-13'!$Q61","v":0},{"$f":"'17-11-13'!$Q61","v":0},{"$f":"'15-12-13'!$Q61","v":0},{"$f":"SUM(F86:J86)","v":0},null,23]
["Notes:"]
[]
[]
["AUSTRALIAN 18Ft League - 2013/14 NSW Championship Pointscore"]
[null,"Best 4 results will count.",{"$f":"'10-11-13'!$G4","v":"2013-11-10"},{"$f":"'15-12-13'!$G4","v":"2013-12-15"},{"$f":"'26-01-14'!$G4","v":"2014-01-26"},{"$f":"'16-02-14'!$G4","v":"2014-02-16"},{"$f":"'16-03-14'!$G4","v":"2014-02-23"},1,"Drop"]
["Recall #","Name","R1","R2","R3","R4","R5","Total","Total","POS"]
[1,"THURLOW FISHER LAWYERS",{"$f":"'10-11-13'!$P15","v":2},{"$f":"'15-12-13'!$P15","v":0},{"$f":"'26-01-14'!$P15","v":0},{"$f":"'16-02-14'!$P15","v":0},{"$f":"'16-03-14'!$P15","v":0},{"$f":"SUM(C93:G93)","v":2},{"$f":"IF(H$91=1,SUM(C93:G93)-MAX(C93:G93),SUM(C93:G93))","v":0},1]
[2,"YANDOO",{"$f":"'10-11-13'!$P16","v":12},{"$f":"'15-12-13'!$P16","v":0},{"$f":"'26-01-14'!$P16","v":0},{"$f":"'16-02-14'!$P16","v":0},{"$f":"'16-03-14'!$P16","v":0},12,0,2]
[3,"ASKO APPLIANCES",{"$f":"'10-11-13'!$P17","v":11},{"$f":"'15-12-13'!$P17","v":0},{"$f":"'26-01-14'!$P17","v":0},{"$f":"'16-02-14'!$P17","v":0},{"$f":"'16-03-14'!$P17","v":0},11,0,3]
[4,"DE’LONGHI-RABBITOHS",{"$f":"'10-11-13'!$P18","v":13},{"$f":"'15-12-13'!$P18","v":0},{"$f":"'26-01-14'!$P18","v":0},{"$f":"'16-02-14'!$P18","v":0},{"$f":"'16-03-14'!$P18","v":0},13,0,4]
[5,"APPLIANCESONLINE.COM.AU",{"$f":"'10-11-13'!$P19","v":5},{"$f":"'15-12-13'!$P19","v":0},{"$f":"'26-01-14'!$P19","v":0},{"$f":"'16-02-14'!$P19","v":0},{"$f":"'16-03-14'!$P19","v":0},5,0,5]
[6,"COOPERS 62-RAG & FAMISH HOTEL",{"$f":"'10-11-13'!$P20","v":9},{"$f":"'15-12-13'!$P20","v":0},{"$f":"'26-01-14'!$P20","v":0},{"$f":"'16-02-14'!$P20","v":0},{"$f":"'16-03-14'!$P20","v":0},9,0,6]
[7,"GOTTA LOVE IT 7",{"$f":"'10-11-13'!$P21","v":1},{"$f":"'15-12-13'!$P21","v":0},{"$f":"'26-01-14'!$P21","v":0},{"$f":"'16-02-14'!$P21","v":0},{"$f":"'16-03-14'!$P21","v":0},1,0,7]
[8,"SMEG",{"$f":"'10-11-13'!$P22","v":3},{"$f":"'15-12-13'!$P22","v":0},{"$f":"'26-01-14'!$P22","v":0},{"$f":"'16-02-14'!$P22","v":0},{"$f":"'16-03-14'!$P22","v":0},3,0,8]
[9,"PURE BLONDE",{"$f":"'10-11-13'!$P23","v":10},{"$f":"'15-12-13'!$P23","v":0},{"$f":"'26-01-14'!$P23","v":0},{"$f":"'16-02-14'!$P23","v":0},{"$f":"'16-03-14'!$P23","v":0},10,0,9]
[10,"FISHER & PAYKEL",{"$f":"'10-11-13'!$P24","v":7},{"$f":"'15-12-13'!$P24","v":0},{"$f":"'26-01-14'!$P24","v":0},{"$f":"'16-02-14'!$P24","v":0},{"$f":"'16-03-14'!$P24","v":0},7,0,10]
[11,"MOJO WINE",{"$f":"'10-11-13'!$P25","v":20},{"$f":"'15-12-13'!$P25","v":0},{"$f":"'26-01-14'!$P25","v":0},{"$f":"'16-02-14'!$P25","v":0},{"$f":"'16-03-14'!$P25","v":0},20,0,11]
[12,"LUMIX",{"$f":"'10-11-13'!$P26","v":6},{"$f":"'15-12-13'!$P26","v":0},{"$f":"'26-01-14'!$P26","v":0},{"$f":"'16-02-14'!$P26","v":0},{"$f":"'16-03-14'!$P26","v":0},6,0,12]
[13,"RABBITOHS-KENWOOD",{"$f":"'10-11-13'!$P27","v":8},{"$f":"'15-12-13'!$P27","v":0},{"$f":"'26-01-14'!$P27","v":0},{"$f":"'16-02-14'!$P27","v":0},{"$f":"'16-03-14'!$P27","v":0},8,0,13]
[14,"THE KITCHEN MAKER",{"$f":"'10-11-13'!$P28","v":14},{"$f":"'15-12-13'!$P28","v":0},{"$f":"'26-01-14'!$P28","v":0},{"$f":"'16-02-14'!$P28","v":0},{"$f":"'16-03-14'!$P28","v":0},14,0,14]
[15,"HAIER APPLIANCES",{"$f":"'10-11-13'!$P29","v":15},{"$f":"'15-12-13'!$P29","v":0},{"$f":"'26-01-14'!$P29","v":0},{"$f":"'16-02-14'!$P29","v":0},{"$f":"'16-03-14'!$P29","v":0},15,0,15]
[16,"SYDNEY CITY MARINE",{"$f":"'10-11-13'!$P30","v":4},{"$f":"'15-12-13'!$P30","v":0},{"$f":"'26-01-14'!$P30","v":0},{"$f":"'16-02-14'!$P30","v":0},{"$f":"'16-03-14'!$P30","v":0},4,0,16]
[17,"COMPASSFOREX.COM.AU",{"$f":"'10-11-13'!$P31","v":16},{"$f":"'15-12-13'!$P31","v":0},{"$f":"'26-01-14'!$P31","v":0},{"$f":"'16-02-14'!$P31","v":0},{"$f":"'16-03-14'!$P31","v":0},16,0,17]
[18,"VIAGOGO",{"$f":"'10-11-13'!$P32","v":20},{"$f":"'15-12-13'!$P32","v":0},{"$f":"'26-01-14'!$P32","v":0},{"$f":"'16-02-14'!$P32","v":0},{"$f":"'16-03-14'!$P32","v":0},20,0,18]
[19,"SOUTHERN CROSS",{"$f":"'10-11-13'!$P33","v":20},{"$f":"'15-12-13'!$P33","v":0},{"$f":"'26-01-14'!$P33","v":0},{"$f":"'16-02-14'!$P33","v":0},{"$f":"'16-03-14'!$P33","v":0},20,0,19]
[20,null,{"$f":"'10-11-13'!$P34","v":20},{"$f":"'17-11-13'!$P34","v":20},{"$f":"'24-11-13'!$P34","v":20},{"$f":"'1-12-13'!$P34","v":20},{"$f":"'16-03-14'!$P34","v":0},80,60,20]
[21,null,{"$f":"'10-11-13'!$P35","v":20},{"$f":"'17-11-13'!$P35","v":20},{"$f":"'24-11-13'!$P35","v":20},{"$f":"'1-12-13'!$P35","v":20},{"$f":"'16-03-14'!$P35","v":0},80,60,21]
[22,null,{"$f":"'10-11-13'!$P36","v":20},{"$f":"'17-11-13'!$P36","v":20},{"$f":"'24-11-13'!$P36","v":20},{"$f":"'1-12-13'!$P36","v":20},{"$f":"'16-03-14'!$P36","v":0},80,60,22]
[23,null,{"$f":"'10-11-13'!$P37","v":20},{"$f":"'17-11-13'!$P37","v":20},{"$f":"'24-11-13'!$P37","v":20},{"$f":"'1-12-13'!$P37","v":20},{"$f":"'16-03-14'!$P37","v":0},80,60,23]
[]
["NOTE:"]
[]
[]
[]
["Australian 18ft Skiff 2013/14 Championship Pointscore"]
[null,"Best 4 results will count.",{"$f":"'12-01-14'!$G4","v":"2014-01-12"},{"$f":"'19-01-14'!$G4","v":"2014-01-19"},{"$f":"'26-01-14'!$G4","v":"2014-01-26"},{"$f":"'2-02-14'!$G4","v":"2014-02-02"},{"$f":"'9-02-14'!$G4","v":"2014-02-09"},null,1,"DROP"]
["Recall","Name","R1","R2","R3","R4","R5"," ","Total","Total","POS"]
[1,"THURLOW FISHER LAWYERS",{"$f":"'12-01-14'!$P15","v":0},{"$f":"'19-01-14'!$P15","v":0},{"$f":"'26-01-14'!$P15","v":0},{"$f":"'2-02-14'!$P15","v":0},{"$f":"'9-02-14'!$P15","v":0},null,{"$f":"SUM(C124:H124)","v":0},{"$f":"IF(I$122=1,SUM(C124:H124)-MAX(C124:H124),SUM(C124:H124))","v":0},1]
[2,"YANDOO",{"$f":"'12-01-14'!$P16","v":0},{"$f":"'19-01-14'!$P16","v":0},{"$f":"'26-01-14'!$P16","v":0},{"$f":"'2-02-14'!$P16","v":0},{"$f":"'9-02-14'!$P16","v":0},null,0,0,2]
[3,"ASKO APPLIANCES",{"$f":"'12-01-14'!$P17","v":0},{"$f":"'19-01-14'!$P17","v":0},{"$f":"'26-01-14'!$P17","v":0},{"$f":"'2-02-14'!$P17","v":0},{"$f":"'9-02-14'!$P17","v":0},null,0,0,3]
[4,"DE’LONGHI-RABBITOHS",{"$f":"'12-01-14'!$P18","v":0},{"$f":"'19-01-14'!$P18","v":0},{"$f":"'26-01-14'!$P18","v":0},{"$f":"'2-02-14'!$P18","v":0},{"$f":"'9-02-14'!$P18","v":0},null,0,0,4]
[5,"APPLIANCESONLINE.COM.AU",{"$f":"'12-01-14'!$P19","v":0},{"$f":"'19-01-14'!$P19","v":0},{"$f":"'26-01-14'!$P19","v":0},{"$f":"'2-02-14'!$P19","v":0},{"$f":"'9-02-14'!$P19","v":0},null,0,0,5]
[6,"COOPERS 62-RAG & FAMISH HOTEL",{"$f":"'12-01-14'!$P20","v":0},{"$f":"'19-01-14'!$P20","v":0},{"$f":"'26-01-14'!$P20","v":0},{"$f":"'2-02-14'!$P20","v":0},{"$f":"'9-02-14'!$P20","v":0},null,0,0,6]
[7,"GOTTA LOVE IT 7",{"$f":"'12-01-14'!$P21","v":0},{"$f":"'19-01-14'!$P21","v":0},{"$f":"'26-01-14'!$P21","v":0},{"$f":"'2-02-14'!$P21","v":0},{"$f":"'9-02-14'!$P21","v":0},null,0,0,7]
[8,"SMEG",{"$f":"'12-01-14'!$P22","v":0},{"$f":"'19-01-14'!$P22","v":0},{"$f":"'26-01-14'!$P22","v":0},{"$f":"'2-02-14'!$P22","v":0},{"$f":"'9-02-14'!$P22","v":0},null,0,0,8]
[9,"PURE BLONDE",{"$f":"'12-01-14'!$P23","v":0},{"$f":"'19-01-14'!$P23","v":0},{"$f":"'26-01-14'!$P23","v":0},{"$f":"'2-02-14'!$P23","v":0},{"$f":"'9-02-14'!$P23","v":0},null,0,0,9]
[10,"FISHER & PAYKEL",{"$f":"'12-01-14'!$P24","v":0},{"$f":"'19-01-14'!$P24","v":0},{"$f":"'26-01-14'!$P24","v":0},{"$f":"'2-02-14'!$P24","v":0},{"$f":"'9-02-14'!$P24","v":0},null,0,0,10]
[11,"MOJO WINE",{"$f":"'12-01-14'!$P25","v":0},{"$f":"'19-01-14'!$P25","v":0},{"$f":"'26-01-14'!$P25","v":0},{"$f":"'2-02-14'!$P25","v":0},{"$f":"'9-02-14'!$P25","v":0},null,0,0,11]
[12,"LUMIX",{"$f":"'12-01-14'!$P26","v":0},{"$f":"'19-01-14'!$P26","v":0},{"$f":"'26-01-14'!$P26","v":0},{"$f":"'2-02-14'!$P26","v":0},{"$f":"'9-02-14'!$P26","v":0},null,0,0,12]
[13,"RABBITOHS-KENWOOD",{"$f":"'12-01-14'!$P27","v":0},{"$f":"'19-01-14'!$P27","v":0},{"$f":"'26-01-14'!$P27","v":0},{"$f":"'2-02-14'!$P27","v":0},{"$f":"'9-02-14'!$P27","v":0},null,0,0,13]
[14,"THE KITCHEN MAKER",{"$f":"'12-01-14'!$P28","v":0},{"$f":"'19-01-14'!$P28","v":0},{"$f":"'26-01-14'!$P28","v":0},{"$f":"'2-02-14'!$P28","v":0},{"$f":"'9-02-14'!$P28","v":0},null,0,0,14]
[15,"HAIER APPLIANCES",{"$f":"'12-01-14'!$P29","v":0},{"$f":"'19-01-14'!$P29","v":0},{"$f":"'26-01-14'!$P29","v":0},{"$f":"'2-02-14'!$P29","v":0},{"$f":"'9-02-14'!$P29","v":0},null,0,0,15]
[16,"SYDNEY CITY MARINE",{"$f":"'12-01-14'!$P30","v":0},{"$f":"'19-01-14'!$P30","v":0},{"$f":"'26-01-14'!$P30","v":0},{"$f":"'2-02-14'!$P30","v":0},{"$f":"'9-02-14'!$P30","v":0},null,0,0,16]
[17,"COMPASSFOREX.COM.AU",{"$f":"'12-01-14'!$P31","v":0},{"$f":"'19-01-14'!$P31","v":0},{"$f":"'26-01-14'!$P31","v":0},{"$f":"'2-02-14'!$P31","v":0},{"$f":"'9-02-14'!$P31","v":0},null,0,0,17]
[18,"VIAGOGO",{"$f":"'12-01-14'!$P32","v":0},{"$f":"'19-01-14'!$P32","v":0},{"$f":"'26-01-14'!$P32","v":0},{"$f":"'2-02-14'!$P32","v":0},{"$f":"'9-02-14'!$P32","v":0},null,0,0,18]
[19,"SOUTHERN CROSS",{"$f":"'12-01-14'!$P33","v":0},{"$f":"'19-01-14'!$P33","v":0},{"$f":"'26-01-14'!$P33","v":0},{"$f":"'2-02-14'!$P33","v":0},{"$f":"'9-02-14'!$P33","v":0},null,0,0,19]
[20,null,{"$f":"'12-01-14'!$P34","v":0},{"$f":"'19-01-14'!$P34","v":0},{"$f":"'26-01-14'!$P34","v":0},{"$f":"'2-02-14'!$P34","v":0},{"$f":"'9-02-14'!$P34","v":0},null,0,0,20]
[21,null,{"$f":"'12-01-14'!$P35","v":0},{"$f":"'19-01-14'!$P35","v":0},{"$f":"'26-01-14'!$P35","v":0},{"$f":"'2-02-14'!$P35","v":0},{"$f":"'9-02-14'!$P35","v":0},null,0,0,21]
[22,null,{"$f":"'12-01-14'!$P36","v":0},{"$f":"'19-01-14'!$P36","v":0},{"$f":"'26-01-14'!$P36","v":0},{"$f":"'2-02-14'!$P36","v":0},{"$f":"'9-02-14'!$P36","v":0},null,0,0,22]
[23,null,{"$f":"'12-01-14'!$P37","v":0},{"$f":"'19-01-14'!$P37","v":0},{"$f":"'26-01-14'!$P37","v":0},{"$f":"'2-02-14'!$P37","v":0},{"$f":"'9-02-14'!$P37","v":0},null,0,0,23]
[24,null,{"$f":"'12-01-14'!$P38","v":0},{"$f":"'19-01-14'!$P38","v":0},{"$f":"'26-01-14'!$P38","v":0},{"$f":"'2-02-14'!$P38","v":0},{"$f":"'9-02-14'!$P38","v":0},null,0,0,24]
[]
[]
["AUSTRALIAN 18Ft League - 2010/11 J. J. Giltinan Selection Point Score"]
[null,"Best 9 results will count.",{"$f":"'10-11-13'!G4","v":"2013-11-10"},{"$f":"'17-11-13'!G4","v":"2013-11-17"},{"$f":"'15-12-13'!G4","v":"2013-12-15"},{"$f":"'1-12-13'!G4","v":"2013-12-01"},{"$f":"'8-12-13'!G4","v":"2013-12-08"},{"$f":"'12-01-14'!G4","v":"2014-01-12"},{"$f":"'19-01-14'!G4","v":"2014-01-19"},{"$f":"'26-01-14'!G4","v":"2014-01-26"},{"$f":"'2-02-14'!G4","v":"2014-02-02"},{"$f":"'9-02-14'!G4","v":"2014-02-09"},null,null,0,"DROPS"]
["Recall","Name","R1","R2","R3","R4","R5","R6","R7","R8","R9","R10",null," ","Total","Total","POS",null,null,null,null,null,null,null,null,null,null,null,null,null,"Drop1","Drop2"]
[1,"THURLOW FISHER LAWYERS",{"$f":"'3-11-13'!$P15","v":0},{"$f":"'10-11-13'!$P15","v":2},{"$f":"'17-11-13'!$P15","v":1},{"$f":"'15-12-13'!$P15","v":0},{"$f":"'1-12-13'!$P15","v":9},{"$f":"'8-12-13'!$P15","v":0},{"$f":"'12-01-14'!$P15","v":0},{"$f":"'19-01-14'!$P15","v":0},{"$f":"'26-01-14'!$P15","v":0},{"$f":"'2-02-14'!$P15","v":0},null,null,{"$f":"SUM(C153:N153)","v":12},{"$f":"IF(O$151=0,O153,O153-AE152-AF152)","v":12},1,null,null,null,null,null,null,null,null,null,null,null,null,null,{"$f":"MAX(C154:N154)","v":6},{"$f":"LARGE(C154:N154,2)","v":5}]
[5,"APPLIANCESONLINE.COM.AU",{"$f":"'3-11-13'!$P19","v":0},{"$f":"'10-11-13'!$P19","v":5},{"$f":"'17-11-13'!$P19","v":2},{"$f":"'15-12-13'!$P19","v":0},{"$f":"'1-12-13'!$P19","v":6},{"$f":"'8-12-13'!$P19","v":0},{"$f":"'12-01-14'!$P19","v":0},{"$f":"'19-01-14'!$P19","v":0},{"$f":"'26-01-14'!$P19","v":0},{"$f":"'2-02-14'!$P19","v":0},null,null,13,13,2,null,null,null,null,null,null,null,null,null,null,null,null,null,9,6]
[6,"RAG & FAMISH HOTEL-COOPERS",{"$f":"'3-11-13'!$P20","v":0},{"$f":"'10-11-13'!$P20","v":9},{"$f":"'17-11-13'!$P20","v":6},{"$f":"'15-12-13'!$P20","v":0},{"$f":"'1-12-13'!$P20","v":1},{"$f":"'8-12-13'!$P20","v":0},{"$f":"'12-01-14'!$P20","v":0},{"$f":"'19-01-14'!$P20","v":0},{"$f":"'26-01-14'!$P20","v":0},{"$f":"'2-02-14'!$P20","v":0},null,null,16,16,3,null,null,null,null,null,null,null,null,null,null,null,null,null,11,6]
[12,"PANASONIC",{"$f":"'3-11-13'!$P26","v":0},{"$f":"'10-11-13'!$P26","v":6},{"$f":"'17-11-13'!$P26","v":3},{"$f":"'15-12-13'!$P26","v":0},{"$f":"'1-12-13'!$P26","v":11},{"$f":"'8-12-13'!$P26","v":0},{"$f":"'12-01-14'!$P26","v":0},{"$f":"'19-01-14'!$P26","v":0},{"$f":"'26-01-14'!$P26","v":0},{"$f":"'2-02-14'!$P26","v":0},null,null,20,20,4,null,null,null,null,null,null,null,null,null,null,null,null,null,12,8]
[8,"SMEG",{"$f":"'3-11-13'!$P22","v":0},{"$f":"'10-11-13'!$P22","v":3},{"$f":"'17-11-13'!$P22","v":12},{"$f":"'15-12-13'!$P22","v":0},{"$f":"'1-12-13'!$P22","v":8},{"$f":"'8-12-13'!$P22","v":0},{"$f":"'12-01-14'!$P22","v":0},{"$f":"'19-01-14'!$P22","v":0},{"$f":"'26-01-14'!$P22","v":0},{"$f":"'2-02-14'!$P22","v":0},null,null,23,23,5,null,null,null,null,null,null,null,null,null,null,null,null,null,12,7]
[2,"YANDOO",{"$f":"'3-11-13'!$P16","v":0},{"$f":"'10-11-13'!$P16","v":12},{"$f":"'17-11-13'!$P16","v":5},{"$f":"'15-12-13'!$P16","v":0},{"$f":"'1-12-13'!$P16","v":7},{"$f":"'8-12-13'!$P16","v":0},{"$f":"'12-01-14'!$P16","v":0},{"$f":"'19-01-14'!$P16","v":0},{"$f":"'26-01-14'!$P16","v":0},{"$f":"'2-02-14'!$P16","v":0},null,null,24,24,6,null,null,null,null,null,null,null,null,null,null,null,null,null,13,8]
[13,"SHARKS",{"$f":"'3-11-13'!$P27","v":0},{"$f":"'10-11-13'!$P27","v":8},{"$f":"'17-11-13'!$P27","v":13},{"$f":"'15-12-13'!$P27","v":0},{"$f":"'1-12-13'!$P27","v":5},{"$f":"'8-12-13'!$P27","v":0},{"$f":"'12-01-14'!$P27","v":0},{"$f":"'19-01-14'!$P27","v":0},{"$f":"'26-01-14'!$P27","v":0},{"$f":"'2-02-14'!$P27","v":0},null,null,26,26,7,null,null,null,null,null,null,null,null,null,null,null,null,null,11,11]
[3,"ASKO APPLIANCES",{"$f":"'3-11-13'!$P17","v":0},{"$f":"'10-11-13'!$P17","v":11},{"$f":"'17-11-13'!$P17","v":11},{"$f":"'15-12-13'!$P17","v":0},{"$f":"'1-12-13'!$P17","v":4},{"$f":"'8-12-13'!$P17","v":0},{"$f":"'12-01-14'!$P17","v":0},{"$f":"'19-01-14'!$P17","v":0},{"$f":"'26-01-14'!$P17","v":0},{"$f":"'2-02-14'!$P17","v":0},null,null,26,26,8,null,null,null,null,null,null,null,null,null,null,null,null,null,13,7]
[10,"FISHER & PAYKEL",{"$f":"'3-11-13'!$P24","v":0},{"$f":"'10-11-13'!$P24","v":7},{"$f":"'17-11-13'!$P24","v":7},{"$f":"'15-12-13'!$P24","v":0},{"$f":"'1-12-13'!$P24","v":13},{"$f":"'8-12-13'!$P24","v":0},{"$f":"'12-01-14'!$P24","v":0},{"$f":"'19-01-14'!$P24","v":0},{"$f":"'26-01-14'!$P24","v":0},{"$f":"'2-02-14'!$P24","v":0},null,null,27,27,9,null,null,null,null,null,null,null,null,null,null,null,null,null,20,4]
[16,"PROJECT RACING",{"$f":"'3-11-13'!$P30","v":0},{"$f":"'10-11-13'!$P30","v":4},{"$f":"'17-11-13'!$P30","v":20},{"$f":"'15-12-13'!$P30","v":0},{"$f":"'1-12-13'!$P30","v":3},{"$f":"'8-12-13'!$P30","v":0},{"$f":"'12-01-14'!$P30","v":0},{"$f":"'19-01-14'!$P30","v":0},{"$f":"'26-01-14'!$P30","v":0},{"$f":"'2-02-14'!$P30","v":0},null,null,27,27,10,null,null,null,null,null,null,null,null,null,null,null,null,null,20,8]
[11,"RED CLAW",{"$f":"'3-11-13'!$P25","v":0},{"$f":"'10-11-13'!$P25","v":20},{"$f":"'17-11-13'!$P25","v":8},{"$f":"'15-12-13'!$P25","v":0},{"$f":"'1-12-13'!$P25","v":2},{"$f":"'8-12-13'!$P25","v":0},{"$f":"'12-01-14'!$P25","v":0},{"$f":"'19-01-14'!$P25","v":0},{"$f":"'26-01-14'!$P25","v":0},{"$f":"'2-02-14'!$P25","v":0},null,null,30,30,11,null,null,null,null,null,null,null,null,null,null,null,null,null,13,12]
[4,"DE'LONGHI",{"$f":"'3-11-13'!$P18","v":0},{"$f":"'10-11-13'!$P18","v":13},{"$f":"'17-11-13'!$P18","v":10},{"$f":"'15-12-13'!$P18","v":0},{"$f":"'1-12-13'!$P18","v":12},{"$f":"'8-12-13'!$P18","v":0},{"$f":"'12-01-14'!$P18","v":0},{"$f":"'19-01-14'!$P18","v":0},{"$f":"'26-01-14'!$P18","v":0},{"$f":"'2-02-14'!$P18","v":0},null,null,35,35,12,null,null,null,null,null,null,null,null,null,null,null,null,null,20,15]
[7,"GOTTA LOVE IT 7",{"$f":"'3-11-13'!$P21","v":0},{"$f":"'10-11-13'!$P21","v":1},{"$f":"'17-11-13'!$P21","v":20},{"$f":"'15-12-13'!$P21","v":0},{"$f":"'1-12-13'!$P21","v":15},{"$f":"'8-12-13'!$P21","v":0},{"$f":"'12-01-14'!$P21","v":0},{"$f":"'19-01-14'!$P21","v":0},{"$f":"'26-01-14'!$P21","v":0},{"$f":"'2-02-14'!$P21","v":0},null,null,36,36,13,null,null,null,null,null,null,null,null,null,null,null,null,null,20,14]
[14,"TF COLLECT",{"$f":"'3-11-13'!$P28","v":0},{"$f":"'10-11-13'!$P28","v":14},{"$f":"'17-11-13'!$P28","v":4},{"$f":"'15-12-13'!$P28","v":0},{"$f":"'1-12-13'!$P28","v":20},{"$f":"'8-12-13'!$P28","v":0},{"$f":"'12-01-14'!$P28","v":0},{"$f":"'19-01-14'!$P28","v":0},{"$f":"'26-01-14'!$P28","v":0},{"$f":"'2-02-14'!$P28","v":0},null,null,38,38,14,null,null,null,null,null,null,null,null,null,null,null,null,null,16,15]
[15,"THE KITCHEN MAKER",{"$f":"'3-11-13'!$P29","v":0},{"$f":"'10-11-13'!$P29","v":15},{"$f":"'17-11-13'!$P29","v":9},{"$f":"'15-12-13'!$P29","v":0},{"$f":"'1-12-13'!$P29","v":16},{"$f":"'8-12-13'!$P29","v":0},{"$f":"'12-01-14'!$P29","v":0},{"$f":"'19-01-14'!$P29","v":0},{"$f":"'26-01-14'!$P29","v":0},{"$f":"'2-02-14'!$P29","v":0},null,null,40,40,15,null,null,null,null,null,null,null,null,null,null,null,null,null,20,14]
[19,null,{"$f":"'3-11-13'!$P33","v":0},{"$f":"'10-11-13'!$P33","v":20},{"$f":"'17-11-13'!$P33","v":14},{"$f":"'15-12-13'!$P33","v":0},{"$f":"'1-12-13'!$P33","v":10},{"$f":"'8-12-13'!$P33","v":0},{"$f":"'12-01-14'!$P33","v":0},{"$f":"'19-01-14'!$P33","v":0},{"$f":"'26-01-14'!$P33","v":0},{"$f":"'2-02-14'!$P33","v":0},null,null,44,44,16,null,null,null,null,null,null,null,null,null,null,null,null,null,16,15]
[17,"COLDWELL BANKER NEW HOMES",{"$f":"'3-11-13'!$P31","v":0},{"$f":"'10-11-13'!$P31","v":16},{"$f":"'17-11-13'!$P31","v":15},{"$f":"'15-12-13'!$P31","v":0},{"$f":"'1-12-13'!$P31","v":14},{"$f":"'8-12-13'!$P31","v":0},{"$f":"'12-01-14'!$P31","v":0},{"$f":"'19-01-14'!$P31","v":0},{"$f":"'26-01-14'!$P31","v":0},{"$f":"'2-02-14'!$P31","v":0},null,null,45,45,17,null,null,null,null,null,null,null,null,null,null,null,null,null,20,20]
[9,"PURE BLONDE",{"$f":"'3-11-13'!$P23","v":0},{"$f":"'10-11-13'!$P23","v":10},{"$f":"'17-11-13'!$P23","v":20},{"$f":"'15-12-13'!$P23","v":0},{"$f":"'1-12-13'!$P23","v":20},{"$f":"'8-12-13'!$P23","v":0},{"$f":"'12-01-14'!$P23","v":0},{"$f":"'19-01-14'!$P23","v":0},{"$f":"'26-01-14'!$P23","v":0},{"$f":"'2-02-14'!$P23","v":0},null,null,50,50,18,null,null,null,null,null,null,null,null,null,null,null,null,null,20,20]
[18,"BOATMATE",{"$f":"'3-11-13'!$P32","v":0},{"$f":"'10-11-13'!$P32","v":20},{"$f":"'17-11-13'!$P32","v":20},{"$f":"'15-12-13'!$P32","v":0},{"$f":"'1-12-13'!$P32","v":17},{"$f":"'8-12-13'!$P32","v":0},{"$f":"'12-01-14'!$P32","v":0},{"$f":"'19-01-14'!$P32","v":0},{"$f":"'26-01-14'!$P32","v":0},{"$f":"'2-02-14'!$P32","v":0},null,null,57,57,19,null,null,null,null,null,null,null,null,null,null,null,null,null,20,20]
[20,null,{"$f":"'3-11-13'!$P34","v":0},{"$f":"'10-11-13'!$P34","v":20},{"$f":"'17-11-13'!$P34","v":20},{"$f":"'15-12-13'!$P34","v":0},{"$f":"'1-12-13'!$P34","v":20},{"$f":"'8-12-13'!$P34","v":0},{"$f":"'12-01-14'!$P34","v":0},{"$f":"'19-01-14'!$P34","v":0},{"$f":"'26-01-14'!$P34","v":0},{"$f":"'2-02-14'!$P34","v":0},null,null,60,60,20,null,null,null,null,null,null,null,null,null,null,null,null,null,20,20]
[21,null,{"$f":"'3-11-13'!$P35","v":0},{"$f":"'10-11-13'!$P35","v":20},{"$f":"'17-11-13'!$P35","v":20},{"$f":"'15-12-13'!$P35","v":0},{"$f":"'1-12-13'!$P35","v":20},{"$f":"'8-12-13'!$P35","v":0},{"$f":"'12-01-14'!$P35","v":0},{"$f":"'19-01-14'!$P35","v":0},{"$f":"'26-01-14'!$P35","v":0},{"$f":"'2-02-14'!$P35","v":0},null,null,60,60,21,null,null,null,null,null,null,null,null,null,null,null,null,null,20,20]
[22,null,{"$f":"'3-11-13'!$P36","v":0},{"$f":"'10-11-13'!$P36","v":20},{"$f":"'17-11-13'!$P36","v":20},{"$f":"'15-12-13'!$P36","v":0},{"$f":"'1-12-13'!$P36","v":20},{"$f":"'8-12-13'!$P36","v":0},{"$f":"'12-01-14'!$P36","v":0},{"$f":"'19-01-14'!$P36","v":0},{"$f":"'26-01-14'!$P36","v":0},{"$f":"'2-02-14'!$P36","v":0},null,null,60,60,22,null,null,null,null,null,null,null,null,null,null,null,null,null,20,20]
[23,null,{"$f":"'3-11-13'!$P37","v":0},{"$f":"'10-11-13'!$P37","v":20},{"$f":"'17-11-13'!$P37","v":20},{"$f":"'15-12-13'!$P37","v":0},{"$f":"'1-12-13'!$P37","v":20},{"$f":"'8-12-13'!$P37","v":0},{"$f":"'12-01-14'!$P37","v":0},{"$f":"'19-01-14'!$P37","v":0},{"$f":"'26-01-14'!$P37","v":0},{"$f":"'2-02-14'!$P37","v":0},null,null,60,60,23]
[]
["NOTE:"]

{"sheet":"8-12-13","index":1,"n_rows":57,"n_cols":18,"rows_kept":57,"cut":false,"hidden":false,"merged":[[52,3,55,7],[53,0,53,1],[54,0,54,1],[49,0,49,2],[49,3,49,7],[51,3,51,7],[50,0,50,2],[50,3,50,7],[51,0,51,2],[48,0,48,2],[48,3,48,7],[12,15,12,16],[12,0,12,1],[12,4,12,6],[47,0,47,2],[47,3,47,7],[46,0,46,2],[46,3,46,7],[9,0,9,1],[0,0,0,7],[1,0,1,7],[3,0,3,1],[3,6,3,7],[7,0,7,1],[7,3,7,4],[7,5,7,7],[6,0,6,1]]}
["Australian 18 Footers League"]
["Starters and Judges Report"]
[]
["Name of Race:",null,{"$f":"Schedule!$D10","v":"3-buoy Challenge-Rnd 8"},"Entrants:",{"$f":"Schedule!G10","v":19},"Date:",{"$f":"Schedule!B10","v":"2013-12-08"}]
[null,null,{"$f":"Schedule!$E10","v":"YANDOO Trophy"}]
[null,null,{"$f":"Schedule!$F10","v":""}]
["Course:",null,"6/3","Wind:","NE 15-20","Tide:","Ebbing",null,null,null,null,null,"Ctrl+Shift+R to formulate H/cap result."]
["Race Start Time:",null,"14:40:00","Race Finish Time :",null,{"$f":"D15","v":"15:47:28"}]
[]
["Start Mode:",null,{"$f":"IF(Schedule!C10=\"3b\",\"HANDICAP\",\"SCRATCH\")","v":"HANDICAP"}]
[null,"Non Starters:",1,"Non Finishers:",8,null,null,0]
[]
["Race Officer:",null,"Doug Cameron",null,null,null,null,null,null,null,null,null,"Entrants",null,null,"Result"]
["Finish Placings","Recall #","Boat Name","Finish Time","Elapsed Time","Handicap","Corrected Time",{"$f":"IF(C10=\"Scratch\",\"H/cap Position\",\"Scratch Position\")","v":"Scratch Position"},null,null,null,"Recall #","Boat Name","H/CAP",null,"Scratch","H/Cap"]
[1,7,{"$f":"IF(ISBLANK(B15),\"\",VLOOKUP(B15,L$15:M$45,2))","v":"GOTTA LOVE IT 7"},"15:47:28",{"$f":"IF(ISBLANK(D15),\"\",D15-C$8)","v":"01:07:28"},{"$f":"IF(ISBLANK(B15),\"\",VLOOKUP(B15,L$15:N$45,3))","v":2},{"$f":"IF(ISBLANK(D15),\"\",IF(C$10=\"Scratch\",E15-TIME(,F15,),E15))","v":"01:07:28"},null,1,null,null,1,"THURLOW FISHER LAWYERS",2,null,null,null,1]
[2,11,"MOJO WINE","15:49:13","01:09:13",0,"01:09:13",null,2,null,null,2,"YANDOO",7,null,null,null,19]
[3,6,"COOPERS 62-RAG & FAMISH HOTEL","15:49:44","01:09:44",1,"01:09:44",null,3,null,null,3,"ASKO APPLIANCES",5,null,null,null,19]
[4,9,"PURE BLONDE","15:50:13","01:10:13",9,"01:10:13",null,4,null,null,4,"DE’LONGHI-RABBITOHS",10,null,null,null,8]
[5,8,"SMEG","15:50:44","01:10:44",3,"01:10:44",null,5,null,null,5,"APPLIANCESONLINE.COM.AU",7,null,null,null,19]
[6,10,"FISHER & PAYKEL","15:50:59","01:10:59",4,"01:10:59",null,6,null,null,6,"COOPERS 62-RAG & FAMISH HOTEL",1,null,null,null,7]
[7,16,"SYDNEY CITY MARINE","15:51:31","01:11:31",3,"01:11:31",null,7,null,null,7,"GOTTA LOVE IT 7",2,null,null,null,4]
[8,4,"DE’LONGHI-RABBITOHS","15:52:49","01:12:49",10,"01:12:49",null,8,null,null,8,"SMEG",3,null,null,null,2]
[9,2,"YANDOO","15:55:17","01:15:17",7,"01:15:17",null,9,null,null,9,"PURE BLONDE",9,null,null,null,6]
[10,13,"RABBITOHS-KENWOOD","16:07:09","01:27:09",7,"01:27:09",null,10,null,null,10,"FISHER & PAYKEL",4,null,null,null,19]
[11,null,"",null,"","","",null,11,null,null,11,"MOJO WINE",0,null,null,null,5]
[12,null,"",null,"","","",null,12,null,null,12,"LUMIX",5,null,null,null,3]
[13,null,"",null,"","","",null,13,null,null,13,"RABBITOHS-KENWOOD",7,null,null,null,19]
[14,null,"",null,"","","",null,14,null,null,14,"THE KITCHEN MAKER",10,null,null,null,19]
[15,null,"",null,"","","",null,15,null,null,15,"HAIER APPLIANCES",5,null,null,null,19]
[16,null,"",null,"","","",null,16,null,null,16,"SYDNEY CITY MARINE",3,null,null,null,19]
[17,null,"",null,"","","",null,17,null,null,17,"COMPASSFOREX.COM.AU",10,null,null,null,19]
[18,null,"",null,"","","",null,18,null,null,18,"VIAGOGO",10,null,null,null,19]
[19,null,"",null,"","","",null,19,null,null,19,"SOUTHERN CROSS",10,null,null,null,19]
[20,null,"",null,"","","",null,20,null,null,20,null,null,null,null,null,19]
[21,null,"",null,"","","",null,21,null,null,21,null,null,null,null,null,19]
[22,null,"",null,"","","",null,22,null,null,22,null,null,null,null,null,19]
[23,null,"",null,"","","",null,23,null,null,23,null,null,null,null,null,19]
[24,null,"",null,"","","",null,24,null,null,null,null,null,null,null,null,19]
[25,null,"",null,"","","",null,25]
[26,null,"",null,"","","",null,26]
[27,null,"",null,"","","",null,27]
[28,null,"",null,"","","",null,28]
[29,null,"",null,"","","",null,29]
[30,null,"",null,"","","",null,30]
[null,null,null,null,"",null,null,null,31]
[]
["Non Starters","Non Starters",null,"Non Finishers","Non Finishers"]
["Lumix",null,null,"Thurlow Fisher Lawyers, Southern Cross"]
[null,null,null,"The Kitchen Maker, Viagogo, Haier Appliances"]
[null,null,null,"Appliancesonline.com.au, Asko Appliances"]
[null,null,null,"Compassforex.com.au"]
[]
[null,null,"Comments:"]
["Sailing Time:",null,{"$f":"E15","v":"01:07:28"}]
["Fastest Time:",null,{"$f":"C15","v":"GOTTA LOVE IT 7"}]
["Margins:","1st - 2nd",{"$f":"D16-D15","v":"00:01:45"}]
[null,"2nd - 3rd",{"$f":"D17-D16","v":"00:00:31"}]

{"sheet":"15-12-13","index":2,"n_rows":57,"n_cols":18,"rows_kept":57,"cut":false,"hidden":false,"merged":[[52,3,55,7],[53,0,53,1],[54,0,54,1],[49,0,49,2],[49,3,49,7],[51,3,51,7],[50,0,50,2],[50,3,50,7],[51,0,51,2],[0,0,0,7],[1,0,1,7],[3,0,3,1],[3,6,3,7],[7,0,7,1],[7,3,7,4],[7,5,7,7],[6,0,6,1],[9,0,9,1],[48,0,48,2],[48,3,48,7],[12,15,12,16],[12,0,12,1],[12,4,12,6],[47,0,47,2],[47,3,47,7],[46,3,46,7],[46,0,46,2]]}
["Australian 18 Footers League"]
["Starters and Judges Report"]
[]
["Name of Race:",null,{"$f":"Schedule!$D11","v":"NSW Championship – Race 2"},"Entrants:",{"$f":"Schedule!G11","v":19},"Date:",{"$f":"Schedule!B11","v":"2013-12-15"}]
[null,null,{"$f":"Schedule!$E11","v":"Club Championship – Race 2"}]
[null,null,{"$f":"Schedule!$F11","v":"Syd. Barnett Jr. Memorial Trophy"},"-AEG 3-buoy Challenge-Rnd 8",null,null,"-YANDOO Trophy"]
["Course:",null,null,"Wind:",null,"Tide:"]
["Race Start Time:",null,null,"Race Finish Time :",null,{"$f":"D15","v":"00:00:00"},null,null,null,null,null,null,"Ctrl+Shift+R to formulate H/cap result."]
[]
["Start Mode:",null,{"$f":"IF(Schedule!C11=\"3b\",\"HANDICAP\",\"SCRATCH\")","v":"SCRATCH"}]
[null,"Non Starters:",0,"Non Finishers:",0,null,null,0]
[]
["Race Officer:",null,null,null,null,null,null,null,null,null,null,null,"Entrants",null,null,"Result"]
["Finish Placings","Recall #","Boat Name","Finish Time","Elapsed Time","Handicap","Corrected Time",{"$f":"IF(C10=\"Scratch\",\"H/cap Position\",\"Scratch Position\")","v":"H/cap Position"},null,null,null,"Recall #","Boat Name","H/CAP",null,"Scratch","H/Cap"]
[1,null,{"$f":"IF(ISBLANK(B15),\"\",VLOOKUP(B15,L$15:M$45,2))","v":""},null,{"$f":"IF(ISBLANK(D15),\"\",D15-C$8)","v":""},{"$f":"IF(ISBLANK(B15),\"\",VLOOKUP(B15,L$15:N$45,3))","v":""},{"$f":"IF(ISBLANK(D15),\"\",IF(C$10=\"Scratch\",E15-TIME(,F15,),E15))","v":""},null,1,null,null,1,null,null,null,null,null,7]
[2,null,"",null,"","","",null,2,null,null,2,null,null,null,null,null,2]
[3,null,"",null,"","","",null,3,null,null,3,null,null,null,null,null,11]
[4,null,"",null,"","","",null,4,null,null,4,null,null,null,null,null,13]
[5,null,"",null,"","","",null,5,null,null,5,null,null,null,null,null,8]
[6,null,"",null,"","","",null,6,null,null,6,null,null,null,null,null,5]
[7,null,"",null,"","","",null,7,null,null,7,null,null,null,null,null,4]
[8,null,"",null,"","","",null,8,null,null,8,null,null,null,null,null,6]
[9,null,"",null,"","","",null,9,null,null,9,null,null,null,null,null,9]
[11,null,"",null,"","","",null,11,null,null,10,null,null,null,null,null,11]
[11,null,"",null,"","","",null,11,null,null,11,null,null,null,null,null,1]
[12,null,"",null,"","","",null,12,null,null,12,null,null,null,null,null,20]
[13,null,"",null,"","","",null,13,null,null,13,null,null,null,null,null,20]
[14,null,"",null,"","","",null,14,null,null,14,null,null,null,null,null,3]
[15,null,"",null,"","",{"$f":"IF(ISBLANK(D29),\"\",IF(C$11=\"Scratch\",E29-TIME(,F29,),E29))","v":""},null,15,null,null,15,null,null,null,null,null,12]
[16,null,"",null,"","","",null,16,null,null,16,null,null,null,null,null,20]
[17,null,"",null,"","","",null,17,null,null,17,null,null,null,null,null,20]
[18,null,"",null,"","","",null,18,null,null,18,null,null,null,null,null,20]
[19,null,"",null,"","","",null,19,null,null,19,null,null,null,null,null,20]
[20,null,"",null,"","","",null,20,null,null,20,null,null,null,null,null,20]
[21,null,"",null,"","","",null,21,null,null,21,null,null,null,null,null,20]
[22,null,"",null,"","","",null,22,null,null,22,null,null,null,null,null,20]
[23,null,"",null,"","","",null,23,null,null,23,null,null,null,null,null,20]
[24,null,"",null,"","","",null,24,null,null,null,null,null,null,null,null,20]
[25,null,"",null,"","","",null,25]
[26,null,"",null,"","","",null,26]
[27,null,"",null,"","","",null,27]
[28,null,"",null,"","","",null,28]
[29,null,"",null,"","","",null,29]
[30,null,"",null,"","","",null,30]
[null,null,"Ella Bache",null,"",null,null,null,31]
[]
["Non Starters","Non Starters",null,"Non Finishers","Non Finishers"]
[]
[]
[]
[]
[]
[null,null,"Comments:"]
["Sailing Time:",null,{"$f":"E15","v":""}]
["Fastest Time:",null,{"$f":"C15","v":""}]
["Margins:","1st - 2nd",{"$f":"D16-D15","v":"00:00:00"}]
[null,"2nd - 3rd",{"$f":"D17-D16","v":"00:00:00"}]

{"sheet":"12-01-14","index":3,"n_rows":57,"n_cols":18,"rows_kept":57,"cut":false,"hidden":false,"merged":[[52,3,55,7],[53,0,53,1],[54,0,54,1],[49,0,49,2],[49,3,49,7],[51,3,51,7],[50,0,50,2],[50,3,50,7],[51,0,51,2],[48,0,48,2],[48,3,48,7],[12,15,12,16],[12,0,12,1],[12,4,12,6],[47,0,47,2],[47,3,47,7],[46,0,46,2],[46,3,46,7],[9,0,9,1],[0,0,0,7],[1,0,1,7],[3,0,3,1],[3,6,3,7],[7,0,7,1],[7,3,7,4],[7,5,7,7],[6,0,6,1]]}
["Australian 18 Footers League"]
["Starters and Judges Report"]
[]
["Name of Race:",null,{"$f":"Schedule!$E12","v":"Club Championship – Race 3"},"Entrants:",{"$f":"Schedule!G12","v":19},"Date:",{"$f":"Schedule!B12","v":"2014-01-12"}]
[null,null,{"$f":"Schedule!$D12","v":"Aust. Championship – Race 1"}]
[null,null,{"$f":"Schedule!$F12","v":""}]
["Course:",null,null,"Wind:",null,"Tide:"]
["Race Start Time:",null,null,"Race Finish Time :",null,{"$f":"D15","v":"00:00:00"},null,null,null,null,null,null,"Ctrl+Shift+R to formulate H/cap result."]
[]
["Start Mode:",null,{"$f":"IF(Schedule!C12=\"3b\",\"HANDICAP\",\"SCRATCH\")","v":"SCRATCH"}]
[null,"Non Starters:",0,"Non Finishers:",0]
[]
["Race Officer:",null,null,null,null,null,null,null,null,null,null,null,"Entrants",null,null,"Result"]
["Finish Placings","Recall #","Boat Name","Finish Time","Elapsed Time","Handicap","Corrected Time",{"$f":"IF(C10=\"Scratch\",\"H/cap Position\",\"Scratch Position\")","v":"H/cap Position"},null,null,null,"Recall #","Boat Name","H/CAP",null,"Scratch","H/Cap"]
[1,null,{"$f":"IF(ISBLANK(B15),\"\",VLOOKUP(B15,L$15:M$45,2))","v":""},null,{"$f":"IF(ISBLANK(D15),\"\",D15-C$8)","v":""},{"$f":"IF(ISBLANK(B15),\"\",VLOOKUP(B15,L$15:N$45,3))","v":""},{"$f":"IF(ISBLANK(D15),\"\",IF(C$10=\"Scratch\",E15-TIME(,F15,),E15))","v":""},null,1,null,null,1,null,null,null,null,null,1]
[2,null,"",null,"","","",null,2,null,null,2,null,null,null,null,null,6]
[3,null,"",null,"","","",null,3,null,null,3,null,null,null,null,null,10]
[4,null,"",null,"","","",null,4,null,null,4,null,null,null,null,null,11]
[5,null,"",null,"","","",null,5,null,null,5,null,null,null,null,null,4]
[6,null,"",null,"","","",null,6,null,null,6,null,null,null,null,null,3]
[7,null,"",null,"","","",null,7,null,null,7,null,null,null,null,null,2]
[8,null,"",null,"","","",null,8,null,null,8,null,null,null,null,null,17]
[9,null,"",null,"","","",null,9,null,null,9,null,null,null,null,null,7]
[10,null,"",null,"","","",null,10,null,null,10,null,null,null,null,null,15]
[11,null,"",null,"","","",null,11,null,null,11,null,null,null,null,null,14]
[12,null,"",null,"","","",null,12,null,null,12,null,null,null,null,null,5]
[13,null,"",null,"","","",null,13,null,null,13,null,null,null,null,null,9]
[14,null,"",null,"","","",null,14,null,null,14,null,null,null,null,null,8]
[15,null,"",null,"","","",null,15,null,null,15,null,null,null,null,null,12]
[16,null,"",null,"","","",null,16,null,null,16,null,null,null,null,null,13]
[17,null,"",null,"","","",null,17,null,null,17,null,null,null,null,null,16]
[18,null,"",null,"","","",null,18,null,null,18,null,null,null,null,null,20]
[19,null,"",null,"","","",null,19,null,null,19,null,null,null,null,null,18]
[20,null,"",null,"","","",null,20,null,null,20,null,null,null,null,null,20]
[21,null,"",null,"","","",null,21,null,null,21,null,null,null,null,null,20]
[22,null,"",null,"","","",null,22,null,null,22,null,null,null,null,null,20]
[23,null,"",null,"","","",null,23,null,null,23,null,null,null,null,null,20]
[24,null,"",null,"","","",null,24,null,null,24,null,null,null,null,null,20]
[25,null,"",null,"","","",null,25]
[26,null,"",null,"","","",null,26]
[27,null,"",null,"","","",null,27]
[28,null,"",null,"","","",null,28]
[29,null,"",null,"","","",null,29]
[30,null,"",null,"","","",null,30]
[null,null,null,null,"",null,null,null,31]
[null,null,null,null,null,null,null,null,null,null,null,null,null,null,null,{"$f":"P45 +1","v":1}]
["Non Starters","Non Starters",null,"Non Finishers","Non Finishers",null,null,null,null,null,null,null,null,null,null,{"$f":"P46 +1","v":2}]
[]
[]
[]
[]
[]
[null,null,"Comments:"]
["Sailing Time:",null,{"$f":"E15","v":""}]
["Fastest Time:",null,{"$f":"C15","v":""}]
["Margins:","1st - 2nd",{"$f":"D16-D15","v":"00:00:00"}]
[null,"2nd - 3rd",{"$f":"D17-D16","v":"00:00:00"}]

{"sheet":"19-01-14","index":4,"n_rows":57,"n_cols":18,"rows_kept":57,"cut":false,"hidden":false,"merged":[[52,3,55,7],[53,0,53,1],[54,0,54,1],[49,0,49,2],[49,3,49,7],[51,3,51,7],[50,0,50,2],[50,3,50,7],[51,0,51,2],[0,0,0,7],[1,0,1,7],[3,0,3,1],[3,6,3,7],[7,0,7,1],[7,3,7,4],[7,5,7,7],[6,0,6,1],[9,0,9,1],[48,0,48,2],[48,3,48,7],[12,15,12,16],[12,0,12,1],[12,4,12,6],[47,0,47,2],[47,3,47,7],[46,3,46,7],[46,0,46,2]]}
["Australian 18 Footers League"]
["Starters and Judges Report"]
[]
["Name of Race:",null,{"$f":"Schedule!$D13","v":"Aust. Championship – Race 2"},"Entrants:",{"$f":"Schedule!G13","v":19},"Date:",{"$f":"Schedule!B13","v":"2014-01-19"}]
[null,null,{"$f":"Schedule!$E13","v":"Club Championship – Race 4"}]
[null,null,{"$f":"Schedule!F13","v":"Cordukes Clubhouse Trophy"}]
["Course:",null,null,"Wind:",null,"Tide:"]
["Race Start Time:",null,null,"Race Finish Time :",null,{"$f":"D15","v":"00:00:00"},null,null,null,null,null,null,"Ctrl+Shift+R to formulate H/cap result."]
[]
["Start Mode:",null,{"$f":"IF(Schedule!C13=\"3b\",\"HANDICAP\",\"SCRATCH\")","v":"SCRATCH"}]
[null,"Non Starters:",0,"Non Finishers:",0]
[]
["Race Officer:",null,null,null,null,null,null,null,null,null,null,null,"Entrants",null,null,"Result"]
["Finish Placings","Recall #","Boat Name","Finish Time","Elapsed Time","Handicap","Corrected Time",{"$f":"IF(C10=\"Scratch\",\"H/cap Position\",\"Scratch Position\")","v":"H/cap Position"},null,null,null,"Recall #","Boat Name","H/CAP",null,"Scratch","H/Cap"]
[1,null,{"$f":"IF(ISBLANK(B15),\"\",VLOOKUP(B15,L$15:M$45,2))","v":""},null,{"$f":"IF(ISBLANK(D15),\"\",D15-C$8)","v":""},{"$f":"IF(ISBLANK(B15),\"\",VLOOKUP(B15,L$15:N$45,3))","v":""},{"$f":"IF(ISBLANK(D15),\"\",IF(C$10=\"Scratch\",E15-TIME(,F15,),E15))","v":""},null,1,null,null,1,null,null,null,null,null,1]
[2,null,"",null,"","","",null,2,null,null,2,null,null,null,null,null,12]
[3,null,"",null,"","","",null,3,null,null,3,null,null,null,null,null,4]
[4,null,"",null,"","","",null,4,null,null,4,null,null,null,null,null,14]
[5,null,"",null,"","","",null,5,null,null,5,null,null,null,null,null,10]
[6,null,"",null,"","","",null,6,null,null,6,null,null,null,null,null,8]
[7,null,"",null,"","","",null,7,null,null,7,null,null,null,null,null,2]
[8,null,"",null,"","","",null,8,null,null,8,null,null,null,null,null,5]
[9,null,"",null,"","","",null,9,null,null,9,null,null,null,null,null,3]
[10,null,"",null,"","","",null,10,null,null,10,null,null,null,null,null,13]
[11,null,"",null,"","","",null,11,null,null,11,null,null,null,null,null,7]
[12,null,"",null,"","","",null,12,null,null,12,null,null,null,null,null,18]
[13,null,"",null,"","","",null,13,null,null,13,null,null,null,null,null,6]
[14,null,"",null,"","","",null,14,null,null,14,null,null,null,null,null,9]
[15,null,"",null,"","","",null,15,null,null,15,null,null,null,null,null,11]
[16,null,"",null,"","","",null,16,null,null,16,null,null,null,null,null,19]
[17,null,"",null,"","","",null,17,null,null,17,null,null,null,null,null,15]
[18,null,"",null,"","","",null,18,null,null,18,null,null,null,null,null,16]
[19,null,"",null,"","","",null,19,null,null,19,null,null,null,null,null,17]
[20,null,"",null,"","","",null,20,null,null,20,null,null,null,null,null,20]
[21,null,"",null,"","","",null,21,null,null,21,null,null,null,null,null,20]
[22,null,"",null,"","","",null,22,null,null,22,null,null,null,null,null,20]
[23,null,"",null,"","","",null,23,null,null,23,null,null,null,null,null,20]
[24,null,"",null,"","","",null,24,null,null,24,null,null,null,null,null,20]
[25,null,"",null,"","","",null,25]
[26,null,"",null,"","","",null,26]
[27,null,"",null,"","","",null,27]
[28,null,"",null,"","","",null,28]
[29,null,"",null,"","","",null,29]
[30,null,"",null,"","","",null,30]
[null,null,null,null,null,null,null,null,31]
[]
["Non Starters","Non Starters",null,"Non Finishers","Non Finishers"]
[]
[]
[]
[]
[]
[null,null,"Comments:"]
["Sailing Time:",null,{"$f":"E15","v":""}]
["Fastest Time:",null,{"$f":"C15","v":""}]
["Margins:","1st - 2nd",{"$f":"D16-D15","v":"00:00:00"}]
[null,"2nd - 3rd",{"$f":"D17-D16","v":"00:00:00"}]

{"sheet":"26-01-14","index":5,"n_rows":57,"n_cols":18,"rows_kept":57,"cut":false,"hidden":false,"merged":[[52,3,55,7],[53,0,53,1],[54,0,54,1],[49,0,49,2],[49,3,49,7],[51,3,51,7],[50,0,50,2],[50,3,50,7],[51,0,51,2],[0,0,0,7],[1,0,1,7],[3,0,3,1],[3,6,3,7],[7,0,7,1],[7,3,7,4],[7,5,7,7],[6,0,6,1],[9,0,9,1],[48,0,48,2],[48,3,48,7],[12,15,12,16],[12,0,12,1],[12,4,12,6],[47,0,47,2],[47,3,47,7],[46,3,46,7],[46,0,46,2]]}
["Australian 18 Footers League"]
["Starters and Judges Report"]
[]
["Name of Race:",null,{"$f":"Schedule!$D14","v":"Aust. Championship – Race 3"},"Entrants:",{"$f":"Schedule!G14","v":19},"Date:",{"$f":"Schedule!B14","v":"2014-01-26"}]
[null,null,{"$f":"Schedule!$E14","v":"NSW Championship – Race 3"}]
[null,null,{"$f":"Schedule!$F14","v":"Lord Mayor's Trophy"}]
["Course:",null,null,"Wind:",null,"Tide:"]
["Race Start Time:",null,null,"Race Finish Time :",null,{"$f":"D15","v":"00:00:00"},null,null,null,null,null,null,"Ctrl+Shift+R to formulate H/cap result."]
[]
["Start Mode:",null,{"$f":"IF(Schedule!C14=\"3b\",\"HANDICAP\",\"SCRATCH\")","v":"SCRATCH"}]
[null,"Non Starters:",0,"Non Finishers:",0]
[]
["Race Officer:",null,null,null,null,null,null,null,null,null,null,null,"Entrants",null,null,"Result"]
["Finish Placings","Recall #","Boat Name","Finish Time","Elapsed Time","Handicap","Corrected Time",{"$f":"IF(C10=\"Scratch\",\"H/cap Position\",\"Scratch Position\")","v":"H/cap Position"},null,null,null,"Recall #","Boat Name","H/CAP",null,"Scratch","H/Cap"]
[1,null,{"$f":"IF(ISBLANK(B15),\"\",VLOOKUP(B15,L$15:M$45,2))","v":""},null,{"$f":"IF(ISBLANK(D15),\"\",D15-C$8)","v":""},{"$f":"IF(ISBLANK(B15),\"\",VLOOKUP(B15,L$15:N$45,3))","v":""},{"$f":"IF(ISBLANK(D15),\"\",IF(C$10=\"Scratch\",E15-TIME(,F15,),E15))","v":""},null,1,null,null,1,null,null,null,null,null,3]
[2,null,"",null,"","","",null,2,null,null,2,null,null,null,null,null,5]
[3,null,"",null,"","","",null,3,null,null,3,null,null,null,null,null,20]
[4,null,"",null,"","","",null,4,null,null,4,null,null,null,null,null,6]
[5,null,"",null,"","","",null,5,null,null,5,null,null,null,null,null,20]
[6,null,"",null,"","","",null,6,null,null,6,null,null,null,null,null,2]
[7,null,"",null,"","","",null,7,null,null,7,null,null,null,null,null,4]
[8,null,"",null,"","","",null,8,null,null,8,null,null,null,null,null,1]
[9,null,"",null,"","","",null,9,null,null,9,null,null,null,null,null,20]
[10,null,"",null,"","","",null,10,null,null,10,null,null,null,null,null,20]
[11,null,"",null,"","","",null,11,null,null,11,null,null,null,null,null,20]
[12,null,"",null,"","","",null,12,null,null,12,null,null,null,null,null,20]
[13,null,"",null,"","","",null,13,null,null,13,null,null,null,null,null,20]
[14,null,"",null,"","","",null,14,null,null,14,null,null,null,null,null,20]
[15,null,"",null,"","","",null,15,null,null,15,null,null,null,null,null,20]
[16,null,"",null,"","","",null,16,null,null,16,null,null,null,null,null,20]
[17,null,"",null,"","","",null,17,null,null,17,null,null,null,null,null,20]
[18,null,"",null,"","","",null,18,null,null,18,null,null,null,null,null,20]
[19,null,"",null,"","","",null,19,null,null,19,null,null,null,null,null,20]
[20,null,"",null,"","","",null,20,null,null,20,null,null,null,null,null,20]
[21,null,"",null,"","","",null,21,null,null,21,null,null,null,null,null,20]
[22,null,"",null,"","","",null,22,null,null,22,null,null,null,null,null,20]
[23,null,"",null,"","","",null,23,null,null,23,null,null,null,null,null,20]
[24,null,"",null,"","","",null,24,null,null,24,null,null,null,null,null,20]
[25,null,"",null,"","","",null,25,null,null,25]
[26,null,"",null,"","","",null,26]
[27,null,"",null,"","","",null,27]
[28,null,"",null,"","","",null,28]
[29,null,"",null,"","","",null,29]
[30,null,"",null,"","","",null,31]
[31,null,"",null,"","","",null,30]
[]
["Non Starters","Non Starters",null,"Non Finishers","Non Finishers"]
[]
[]
[]
[]
[]
[null,null,"Comments:"]
["Sailing Time:",null,{"$f":"E15","v":""}]
["Fastest Time:",null,{"$f":"C15","v":""}]
["Margins:","1st - 2nd",{"$f":"D16-D15","v":"00:00:00"}]
[null,"2nd - 3rd",{"$f":"D17-D16","v":"00:00:00"}]

{"sheet":"2-02-14","index":6,"n_rows":57,"n_cols":18,"rows_kept":57,"cut":false,"hidden":false,"merged":[[52,3,55,7],[53,0,53,1],[54,0,54,1],[49,0,49,2],[49,3,49,7],[51,3,51,7],[50,0,50,2],[50,3,50,7],[51,0,51,2],[0,0,0,7],[1,0,1,7],[3,0,3,1],[3,6,3,7],[7,0,7,1],[7,3,7,4],[7,5,7,7],[6,0,6,1],[9,0,9,1],[48,0,48,2],[48,3,48,7],[12,15,12,16],[12,0,12,1],[12,4,12,6],[47,0,47,2],[47,3,47,7],[46,3,46,7],[46,0,46,2]]}
["Australian 18 Footers League"]
["Starters and Judges Report"]
[]
["Name of Race:",null,{"$f":"Schedule!$D15","v":"Aust. Championship – Race 4"},"Entrants:",{"$f":"Schedule!G15","v":19},"Date:",{"$f":"Schedule!B15","v":"2014-02-02"}]
[null,null,{"$f":"Schedule!$E15","v":"Club Championship – Race 6"}]
[null,null,{"$f":"Schedule!$F15","v":"Commodore Cup"}]
["Course:",null,null,"Wind:",null,"Tide:"]
["Race Start Time:",null,null,"Race Finish Time :",null,{"$f":"D15","v":"00:00:00"},null,null,null,null,null,null,"Ctrl+Shift+R to formulate H/cap result."]
[]
["Start Mode:",null,{"$f":"IF(Schedule!C15=\"3b\",\"HANDICAP\",\"SCRATCH\")","v":"SCRATCH"}]
[null,"Non Starters:",0,"Non Finishers:",0]
[]
["Race Officer:",null,null,null,null,null,null,null,null,null,null,null,"Entrants",null,null,"Result"]
["Finish Placings","Recall #","Boat Name","Finish Time","Elapsed Time","Handicap","Corrected Time",{"$f":"IF(C10=\"Scratch\",\"H/cap Position\",\"Scratch Position\")","v":"H/cap Position"},null,null,null,"Recall #","Boat Name","H/CAP",null,"Scratch","H/Cap"]
[1,null,{"$f":"IF(ISBLANK(B15),\"\",VLOOKUP(B15,L$15:M$45,2))","v":""},null,{"$f":"IF(ISBLANK(D15),\"\",D15-C$8)","v":""},{"$f":"IF(ISBLANK(B15),\"\",VLOOKUP(B15,L$15:N$45,3))","v":""},{"$f":"IF(ISBLANK(D15),\"\",IF(C$10=\"Scratch\",E15-TIME(,F15,),E15))","v":""},null,1,null,null,1,null,null,null,null,null,6]
[2,null,"",null,"","","",null,2,null,null,2,null,null,null,null,null,9]
[3,null,"",null,"","","",null,3,null,null,3,null,null,null,null,null,20]
[4,null,"",null,"","","",null,4,null,null,4,null,null,null,null,null,7]
[5,null,"",null,"","","",null,5,null,null,5,null,null,null,null,null,4]
[6,null,"",null,"","","",null,6,null,null,6,null,null,null,null,null,8]
[7,null,"",null,"","","",null,7,null,null,7,null,null,null,null,null,2]
[8,null,"",null,"","","",null,8,null,null,8,null,null,null,null,null,1]
[9,null,"",null,"","","",null,9,null,null,9,null,null,null,null,null,20]
[10,null,"",null,"","","",null,10,null,null,10,null,null,null,null,null,14]
[11,null,"",null,"","","",null,11,null,null,11,null,null,null,null,null,11]
[12,null,"",null,"","","",null,12,null,null,12,null,null,null,null,null,5]
[13,null,"",null,"","","",null,13,null,null,13,null,null,null,null,null,12]
[14,null,"",null,"","","",null,14,null,null,14,null,null,null,null,null,10]
[15,null,"",null,"","","",null,15,null,null,15,null,null,null,null,null,3]
[16,null,"",null,"","","",null,16,null,null,16,null,null,null,null,null,16]
[17,null,"",null,"","","",null,17,null,null,17,null,null,null,null,null,15]
[18,null,"",null,"","","",null,18,null,null,18,null,null,null,null,null,20]
[19,null,"",null,"","","",null,19,null,null,19,null,null,null,null,null,13]
[20,null,null,null,"","","",null,20,null,null,20,null,null,null,null,null,20]
[21,null,{"$f":"IF(ISBLANK(B35),\"\",VLOOKUP(B35,L$15:M$45,2))","v":""},null,"","","",null,21,null,null,21,null,null,null,null,null,20]
[22,null,"",null,"","","",null,22,null,null,22,null,null,null,null,null,20]
[23,null,"",null,"","","",null,23,null,null,23,null,null,null,null,null,20]
[24,null,"",null,"","","",null,24,null,null,24,null,null,null,null,null,20]
[25,null,"",null,"","","",null,25]
[26,null,"",null,"","","",null,26]
[27,null,"",null,"","","",null,27]
[28,null,"",null,"","","",null,28]
[29,null,"",null,"","","",null,29]
["Visitor",null,"CST Composites",null,"",null,null,null,30]
["Visitor",null,null,null,null,null,null,null,31]
[]
["Non Starters","Non Starters",null,"Non Finishers","Non Finishers"]
[]
[]
[]
[]
[]
[null,null,"Comments:"]
["Sailing Time:",null,{"$f":"E15","v":""}]
["Fastest Time:",null,{"$f":"C15","v":""}]
["Margins:","1st - 2nd",{"$f":"D16-D15","v":"00:00:00"}]
[null,"2nd - 3rd",{"$f":"D17-D16","v":"00:00:00"}]

{"sheet":"9-02-14","index":7,"n_rows":57,"n_cols":18,"rows_kept":57,"cut":false,"hidden":false,"merged":[[52,3,55,7],[53,0,53,1],[54,0,54,1],[49,0,49,2],[49,3,49,7],[51,3,51,7],[50,0,50,2],[50,3,50,7],[51,0,51,2],[48,0,48,2],[48,3,48,7],[12,15,12,16],[12,0,12,1],[12,4,12,6],[47,0,47,2],[47,3,47,7],[46,0,46,2],[46,3,46,7],[9,0,9,1],[0,0,0,7],[1,0,1,7],[3,0,3,1],[3,6,3,7],[7,0,7,1],[7,3,7,4],[7,5,7,7],[6,0,6,1]]}
["Australian 18 Footers League"]
["Starters and Judges Report"]
[]
["Name of Race:",null,{"$f":"Schedule!$D16","v":"Aust. Championship – Race 5"},"Entrants:",{"$f":"Schedule!G16","v":19},"Date:",{"$f":"Schedule!B16","v":"2014-02-09"}]
[null,null,{"$f":"Schedule!$E16","v":"Club Championship – Race 7"}]
[null,null,{"$f":"Schedule!$F16","v":""}]
["Course:",null,null,"Wind:",null,"Tide:"]
["Race Start Time:",null,null,"Race Finish Time :",null,{"$f":"D15","v":"00:00:00"},null,null,null,null,null,null,"Ctrl+Shift+R to formulate H/cap result."]
[]
["Start Mode:",null,{"$f":"IF(Schedule!C16=\"3b\",\"HANDICAP\",\"SCRATCH\")","v":"SCRATCH"}]
[null,"Non Starters:",0,"Non Finishers:",0]
[]
["Race Officer:",null,null,null,null,null,null,null,null,null,null,null,"Entrants",null,null,"Result"]
["Finish Placings","Recall #","Boat Name","Finish Time","Elapsed Time","Handicap","Corrected Time",{"$f":"IF(C10=\"Scratch\",\"H/cap Position\",\"Scratch Position\")","v":"H/cap Position"},null,null,null,"Recall #","Boat Name","H/CAP",null,"Scratch","H/Cap"]
[1,null,{"$f":"IF(ISBLANK(B15),\"\",VLOOKUP(B15,L$15:M$45,2))","v":""},null,{"$f":"IF(ISBLANK(D15),\"\",D15-C$8)","v":""},{"$f":"IF(ISBLANK(B15),\"\",VLOOKUP(B15,L$15:N$45,3))","v":""},{"$f":"IF(ISBLANK(D15),\"\",IF(C$10=\"Scratch\",E15-TIME(,F15,),E15))","v":""},null,1,null,null,1,null,null,null,null,null,10]
[2,null,"",null,"","","",null,2,null,null,2,null,null,null,null,null,8]
[3,null,"",null,"","","",null,3,null,null,3,null,null,null,null,null,20]
[4,null,"",null,"","","",null,4,null,null,4,null,null,null,null,null,13]
[5,null,"",null,"","","",null,5,null,null,5,null,null,null,null,null,20]
[6,null,"",null,"","","",null,6,null,null,6,null,null,null,null,null,1]
[7,null,"",null,"","","",null,7,null,null,7,null,null,null,null,null,2]
[8,null,"",null,"","","",null,8,null,null,8,null,null,null,null,null,3]
[9,null,"",null,"","","",null,9,null,null,9,null,null,null,null,null,6]
[10,null,"",null,"","","",null,10,null,null,10,null,null,null,null,null,9]
[11,null,"",null,"","","",null,11,null,null,11,null,null,null,null,null,7]
[12,null,"",null,"","","",null,12,null,null,12,null,null,null,null,null,5]
[13,null,"",null,"","","",null,13,null,null,13,null,null,null,null,null,11]
[14,null,"",null,"","","",null,14,null,null,14,null,null,null,null,null,4]
[15,null,"",null,"","","",null,15,null,null,15,null,null,null,null,null,20]
[16,null,"",null,"","","",null,16,null,null,16,null,null,null,null,null,20]
[17,null,"",null,"","","",null,17,null,null,17,null,null,null,null,null,12]
[18,null,"",null,"","","",null,18,null,null,18,null,null,null,null,null,20]
[19,null,"",null,"","","",null,19,null,null,19,null,null,null,null,null,20]
[20,null,null,null,"","",null,null,20,null,null,20,null,null,null,null,null,20]
[21,null,{"$f":"IF(ISBLANK(B35),\"\",VLOOKUP(B35,L$15:M$45,2))","v":""},null,"","",{"$f":"IF(ISBLANK(D35),\"\",IF(C$10=\"Scratch\",E35-TIME(,F35,),E35))","v":""},null,21,null,null,21,null,null,null,null,null,20]
[22,null,"",null,"","","",null,22,null,null,22,null,null,null,null,null,20]
[23,null,"",null,"","","",null,23,null,null,23,null,null,null,null,null,20]
[24,null,"",null,"","","",null,24,null,null,24,null,null,null,null,null,20]
[25,null,"",null,"","","",null,25]
[26,null,"",null,"","","",null,26]
[27,null,"",null,"","","",null,27]
[28,null,"",null,"","","",null,28]
[29,null,"",null,"","","",null,29]
["Visitor",null,null,null,"",null,null,null,30]
["Visitor",null,null,null,null,null,null,null,31]
[]
["Non Starters","Non Starters",null,"Non Finishers","Non Finishers"]
[]
[]
[]
[]
[]
[null,null,"Comments:"]
["Sailing Time:",null,{"$f":"E15","v":""}]
["Fastest Time:",null,{"$f":"C15","v":""}]
["Margins:","1st - 2nd",{"$f":"D16-D15","v":"00:00:00"}]
[null,"2nd - 3rd",{"$f":"D17-D16","v":"00:00:00"}]

{"sheet":"16-02-14","index":8,"n_rows":57,"n_cols":18,"rows_kept":57,"cut":false,"hidden":false,"merged":[[52,3,55,7],[53,0,53,1],[54,0,54,1],[49,0,49,2],[49,3,49,7],[51,3,51,7],[50,0,50,2],[50,3,50,7],[51,0,51,2],[0,0,0,7],[1,0,1,7],[3,0,3,1],[3,6,3,7],[7,0,7,1],[7,3,7,4],[7,5,7,7],[6,0,6,1],[9,0,9,1],[48,0,48,2],[48,3,48,7],[12,15,12,16],[12,0,12,1],[12,4,12,6],[47,0,47,2],[47,3,47,7],[46,3,46,7],[46,0,46,2]]}
["Australian 18 Footers League"]
["Starters and Judges Report"]
[]
["Name of Race:",null,{"$f":"Schedule!$D17","v":"NSW Championship – Race 4"},"Entrants:",{"$f":"Schedule!G17","v":19},"Date:",{"$f":"Schedule!B17","v":"2014-02-16"}]
[null,null,{"$f":"Schedule!$E17","v":"Club Championship – Race 8"}]
[null,null,{"$f":"Schedule!$F17","v":"President’s Trophy"}]
["Course:",null,null,"Wind:",null,"Tide:",null,null,null,null,null,null,"Ctrl+Shift+R to formulate H/cap result."]
["Race Start Time:",null,null,"Race Finish Time :",null,{"$f":"D15","v":"00:00:00"}]
[]
["Start Mode:",null,{"$f":"IF(Schedule!C17=\"3b\",\"HANDICAP\",\"SCRATCH\")","v":"SCRATCH"}]
[null,"Non Starters:",0,"Non Finishers:",0]
[]
["Race Officer:",null,null,null,null,null,null,null,null,null,null,null,"Entrants",null,null,"Result"]
["Finish Placings","Recall #","Boat Name","Finish Time","Elapsed Time","Handicap","Corrected Time",{"$f":"IF(C10=\"Scratch\",\"H/cap Position\",\"Scratch Position\")","v":"H/cap Position"},null,null,null,"Recall #","Boat Name","H/CAP",null,"Scratch","H/Cap"]
[1,null,{"$f":"IF(ISBLANK(B15),\"\",VLOOKUP(B15,L$15:M$45,2))","v":""},null,{"$f":"IF(ISBLANK(D15),\"\",D15-C$8)","v":""},{"$f":"IF(ISBLANK(B15),\"\",VLOOKUP(B15,L$15:N$45,3))","v":""},{"$f":"IF(ISBLANK(D15),\"\",IF(C$10=\"Scratch\",E15-TIME(,F15,),E15))","v":""},null,1,null,null,1,null,null,null,null,null,1]
[2,null,"",null,"","","",null,2,null,null,2,null,null,null,null,null,5]
[3,null,"",null,"","","",null,3,null,null,3,null,null,null,null,null,20]
[4,null,"",null,"","","",null,4,null,null,4,null,null,null,null,null,7]
[5,null,"",null,"","","",null,5,null,null,5,null,null,null,null,null,20]
[6,null,"",null,"","","",null,6,null,null,6,null,null,null,null,null,20]
[7,null,"",null,"","","",null,7,null,null,7,null,null,null,null,null,20]
[8,null,"",null,"","","",null,8,null,null,8,null,null,null,null,null,2]
[9,null,"",null,"","","",null,9,null,null,9,null,null,null,null,null,3]
[10,null,"",null,"","","",null,10,null,null,10,null,null,null,null,null,9]
[11,null,"",null,"","","",null,11,null,null,11,null,null,null,null,null,4]
[12,null,"",null,"","","",null,12,null,null,12,null,null,null,null,null,6]
[13,null,"",null,"","","",null,13,null,null,13,null,null,null,null,null,20]
[14,null,"",null,"","","",null,14,null,null,14,null,null,null,null,null,8]
[15,null,"",null,"","","",null,15,null,null,15,null,null,null,null,null,20]
[16,null,"",null,"","","",null,16,null,null,16,null,null,null,null,null,20]
[17,null,"",null,"","","",null,17,null,null,17,null,null,null,null,null,20]
[18,null,"",null,"","","",null,18,null,null,18,null,null,null,null,null,20]
[19,null,"",null,"","","",null,19,null,null,19,null,null,null,null,null,20]
[20,null,"",null,"","","",null,20,null,null,20,null,null,null,null,null,20]
[21,null,"",null,"","","",null,21,null,null,21,null,null,null,null,null,20]
[22,null,"",null,"","","",null,22,null,null,22,null,null,null,null,null,20]
[23,null,"",null,"","","",null,23,null,null,23,null,null,null,null,null,20]
[24,null,"",null,"","","",null,24,null,null,null,null,null,null,null,null,20]
[25,null,"",null,"","","",null,25]
[26,null,"",null,"","","",null,26]
[27,null,"",null,"","","",null,27]
[28,null,"",null,"","","",null,28]
[29,null,"",null,"","","",null,29]
["Visitor",null,null,null,"","","",null,30]
["Visitor",null,null,null,null,null,null,null,31]
[]
["Non Starters","Non Starters",null,"Non Finishers","Non Finishers"]
[]
[]
[]
[]
[]
[null,null,"Comments:"]
["Sailing Time:",null,{"$f":"E15","v":""}]
["Fastest Time:",null,{"$f":"C15","v":""}]
["Margins:","1st - 2nd",{"$f":"D16-D15","v":"00:00:00"}]
[null,"2nd - 3rd",{"$f":"D17-D16","v":"00:00:00"}]

{"sheet":"23-02-14","index":9,"n_rows":57,"n_cols":18,"rows_kept":57,"cut":false,"hidden":false,"merged":[[48,3,48,7],[49,0,49,2],[9,0,9,1],[7,0,7,1],[7,3,7,4],[7,5,7,7],[0,0,0,7],[1,0,1,7],[3,0,3,1],[3,6,3,7],[6,0,6,1],[12,15,12,16],[52,3,55,7],[53,0,53,1],[54,0,54,1],[50,0,50,2],[50,3,50,7],[51,0,51,2],[51,3,51,7],[46,0,46,2],[46,3,46,7],[12,4,12,6],[12,0,12,1],[49,3,49,7],[47,3,47,7],[48,0,48,2],[47,0,47,2]]}
["Australian 18 Footers League"]
["Starters and Judges Report"]
[]
["Name of Race:",null,{"$f":"Schedule!$D18","v":"NSW Championship – Race 5"},"Entrants:",{"$f":"Schedule!G18","v":19},"Date:",{"$f":"Schedule!B19","v":"2014-03-16"}]
[null,null,{"$f":"Schedule!E18","v":"Club Championship – Race 9"}]
[null,null,{"$f":"Schedule!$F19","v":""}]
["Course:",null,null,"Wind:",null,"Tide:"]
["Race Start Time:",null,null,"Race Finish Time :",null,{"$f":"D15","v":"00:00:00"},null,null,null,null,null,null,"Ctrl+Shift+R to formulate H/cap result."]
[]
["Start Mode:",null,{"$f":"IF(Schedule!$C18=\"3b\",\"HANDICAP\",\"SCRATCH\")","v":"SCRATCH"}]
[null,"Non Starters:",0,"Non Finishers:",0]
[]
["Race Officer:",null,null,null,null,null,null,null,null,null,null,null,"Entrants",null,null,"Result"]
["Finish Placings","Recall #","Boat Name","Finish Time","Elapsed Time","Handicap","Corrected Time",{"$f":"IF(C10=\"Scratch\",\"H/cap Position\",\"Scratch Position\")","v":"H/cap Position"},null,null,null,"Recall #","Boat Name","H/CAP",null,"Scratch","H/Cap"]
[1,null,{"$f":"IF(ISBLANK(B15),\"\",VLOOKUP(B15,L$15:M$45,2))","v":""},null,{"$f":"IF(ISBLANK(D15),\"\",D15-C$8)","v":""},{"$f":"IF(ISBLANK(B15),\"\",VLOOKUP(B15,L$15:N$45,3))","v":""},{"$f":"IF(ISBLANK(D15),\"\",IF(C$10=\"Scratch\",E15-TIME(,F15,),E15))","v":""},null,1,null,null,1,null,null,null,null,null,11]
[2,null,"",null,"","","",null,2,null,null,2,null,null,null,null,null,4]
[3,null,"",null,"","","",null,3,null,null,3,null,null,null,null,null,6]
[4,null,"",null,"","","",null,4,null,null,4,null,null,null,null,null,2]
[5,null,"",null,"","","",null,5,null,null,5,null,null,null,null,null,8]
[6,null,"",null,"","","",null,6,null,null,6,null,null,null,null,null,9]
[7,null,"",null,"","","",null,7,null,null,7,null,null,null,null,null,10]
[8,null,"",null,"","","",null,8,null,null,8,null,null,null,null,null,3]
[9,null,"",null,"","","",null,9,null,null,9,null,null,null,null,null,7]
[10,null,"",null,"","","",null,10,null,null,10,null,null,null,null,null,20]
[11,null,"",null,"","","",null,11,null,null,11,null,null,null,null,null,1]
[12,null,"",null,"","","",null,12,null,null,12,null,null,null,null,null,20]
[13,null,"",null,"","","",null,13,null,null,13,null,null,null,null,null,20]
[14,null,"",null,"","","",null,14,null,null,14,null,null,null,null,null,20]
[15,null,"",null,"","","",null,15,null,null,15,null,null,null,null,null,5]
[16,null,"",null,"","","",null,16,null,null,16,null,null,null,null,null,20]
[17,null,"",null,"","","",null,17,null,null,17,null,null,null,null,null,20]
[18,null,"",null,"","","",null,18,null,null,18,null,null,null,null,null,20]
[19,null,"",null,"","","",null,19,null,null,19,null,null,null,null,null,20]
[20,null,"",null,"","","",null,20,null,null,20,null,null,null,null,null,20]
[21,null,"",null,"","","",null,21,null,null,21,null,null,null,null,null,20]
[22,null,"",null,"","","",null,22,null,null,22,null,null,null,null,null,20]
[23,null,"",null,"","","",null,23,null,null,23,null,null,null,null,null,20]
[24,null,"",null,"","","",null,24,null,null,24,null,null,null,null,null,20]
[25,null,"",null,"","","",null,25]
[26,null,"",null,"","","",null,26]
[27,null,"",null,"","","",null,27]
[28,null,"",null,"","","",null,28]
[29,null,"",null,"","","",null,29]
[30,null,"",null,"","","",null,30]
[31,null,null,null,null,null,null,null,31]
[]
["Non Starters","Non Starters",null,"Non Finishers","Non Finishers"]
[]
[]
[]
[]
[]
[null,null,"Comments:"]
["Sailing Time:",null,{"$f":"E15","v":""}]
["Fastest Time:",null,{"$f":"C15","v":""}]
["Margins:","1st - 2nd",{"$f":"D16-D15","v":"00:00:00"}]
[null,"2nd - 3rd",{"$f":"D17-D16","v":"00:00:00"}]

{"sheet":"16-03-14","index":10,"n_rows":57,"n_cols":18,"rows_kept":57,"cut":false,"hidden":false,"merged":[[52,3,55,7],[53,0,53,1],[54,0,54,1],[49,0,49,2],[49,3,49,7],[51,3,51,7],[50,0,50,2],[50,3,50,7],[51,0,51,2],[48,0,48,2],[48,3,48,7],[12,15,12,16],[12,0,12,1],[12,4,12,6],[47,0,47,2],[47,3,47,7],[46,0,46,2],[46,3,46,7],[9,0,9,1],[0,0,0,7],[1,0,1,7],[3,0,3,1],[3,6,3,7],[7,0,7,1],[7,3,7,4],[7,5,7,7],[6,0,6,1]]}
["Australian 18 Footers League"]
["Starters and Judges Report"]
[]
["Name of Race:",null,{"$f":"Schedule!$D19","v":"Club Championship – Race 10"},"Entrants:",{"$f":"Schedule!G19","v":19},"Date:",{"$f":"Schedule!B18","v":"2014-02-23"}]
[null,null,{"$f":"Schedule!$E19","v":"Ferry Patrons Trophy"}]
[null,null,{"$f":"Schedule!$F18","v":""}]
["Course:",null,null,"Wind:",null,"Tide:"]
["Race Start Time:",null,null,"Race Finish Time :",null,{"$f":"D15","v":"00:00:00"},null,null,null,null,null,null,"Ctrl+Shift+R to formulate H/cap result."]
[]
["Start Mode:",null,{"$f":"IF(Schedule!C19=\"3b\",\"HANDICAP\",\"SCRATCH\")","v":"HANDICAP"}]
[null,"Non Starters:",0,"Non Finishers:",0]
[]
["Race Officer:",null,null,null,null,null,null,null,null,null,null,null,"Entrants",null,null,"Result"]
["Finish Placings","Recall #","Boat Name","Finish Time","Elapsed Time","Handicap","Corrected Time",{"$f":"IF(C10=\"Scratch\",\"H/cap Position\",\"Scratch Position\")","v":"Scratch Position"},null,null,null,"Recall #","Boat Name","H/CAP",null,"Scratch","H/Cap"]
[1,null,{"$f":"IF(ISBLANK(B15),\"\",VLOOKUP(B15,L$15:M$45,2))","v":""},null,{"$f":"IF(ISBLANK(D15),\"\",D15-C$8)","v":""},{"$f":"IF(ISBLANK(B15),\"\",VLOOKUP(B15,L$15:N$45,3))","v":""},{"$f":"IF(ISBLANK(D15),\"\",IF(C$10=\"Scratch\",E15-TIME(,F15,),E15))","v":""},null,1,null,null,1,null,null,null,null,null,4]
[2,null,"",null,"","","",null,2,null,null,2,null,null,null,null,null,7]
[3,null,"",null,"","","",null,3,null,null,3,null,null,null,null,null,12]
[4,null,"",null,"","","",null,4,null,null,4,null,null,null,null,null,6]
[5,null,"",null,"","","",null,5,null,null,5,null,null,null,null,null,20]
[6,null,"",null,"","","",null,6,null,null,6,null,null,null,null,null,8]
[7,null,"",null,"","","",null,7,null,null,7,null,null,null,null,null,1]
[8,null,"",null,"","","",null,8,null,null,8,null,null,null,null,null,2]
[9,null,"",null,"","","",null,9,null,null,9,null,null,null,null,null,3]
[10,null,"",null,"","","",null,10,null,null,10,null,null,null,null,null,13]
[11,null,"",null,"","","",null,11,null,null,11,null,null,null,null,null,9]
[12,null,"",null,"","","",null,12,null,null,12,null,null,null,null,null,5]
[13,null,"",null,"","","",null,13,null,null,13,null,null,null,null,null,10]
[14,null,"",null,"","","",null,14,null,null,14,null,null,null,null,null,20]
[15,null,"",null,"","","",null,15,null,null,15,null,null,null,null,null,14]
[16,null,"",null,"","","",null,16,null,null,16,null,null,null,null,null,20]
[17,null,"",null,"","","",null,17,null,null,17,null,null,null,null,null,11]
[18,null,"",null,"","","",null,18,null,null,18,null,null,null,null,null,15]
[19,null,"",null,"","","",null,19,null,null,19,null,null,null,null,null,20]
[20,null,"",null,"","","",null,20,null,null,20,null,null,null,null,null,20]
[21,null,"",null,"","","",null,21,null,null,21,null,null,null,null,null,20]
[22,null,"",null,"","","",null,22,null,null,22,null,null,null,null,null,20]
[23,null,"",null,"","","",null,23,null,null,23,null,null,null,null,null,20]
[24,null,"",null,"","","",null,24,null,null,null,null,null,null,null,null,20]
[25,null,"",null,"","","",null,25]
[26,null,"",null,"","","",null,26]
[27,null,"",null,"","","",null,27]
[28,null,"",null,"","","",null,28]
[29,null,"",null,"","","",null,29]
[30,null,"",null,"","","",null,30]
[31,null,null,null,null,null,null,null,31]
[]
["Non Starters","Non Starters",null,"Non Finishers","Non Finishers"]
[]
[]
[]
[]
[]
[null,null,"Comments:"]
["Sailing Time:",null,{"$f":"E15","v":""}]
["Fastest Time:",null,{"$f":"C15","v":""}]
["Margins:","1st - 2nd",{"$f":"D16-D15","v":"00:00:00"}]
[null,"2nd - 3rd",{"$f":"D17-D16","v":"00:00:00"}]

{"sheet":"23-03-14","index":11,"n_rows":57,"n_cols":18,"rows_kept":57,"cut":false,"hidden":false,"merged":[[48,3,48,7],[49,0,49,2],[9,0,9,1],[7,0,7,1],[7,3,7,4],[7,5,7,7],[0,0,0,7],[1,0,1,7],[3,0,3,1],[3,6,3,7],[6,0,6,1],[12,15,12,16],[52,3,55,7],[53,0,53,1],[54,0,54,1],[50,0,50,2],[50,3,50,7],[51,0,51,2],[51,3,51,7],[46,0,46,2],[46,3,46,7],[12,4,12,6],[12,0,12,1],[49,3,49,7],[47,3,47,7],[48,0,48,2],[47,0,47,2]]}
["Australian 18 Footers League"]
["Starters and Judges Report"]
[]
["Name of Race:",null,{"$f":"Schedule!$D20","v":"Queen of the Harbour"},"Entrants:",{"$f":"Schedule!G20","v":19},"Date:",{"$f":"Schedule!B20","v":"2014-03-23"}]
[null,null,{"$f":"Schedule!$E20","v":""}]
[]
["Course:",null,null,"Wind:",null,"Tide:"]
["Race Start Time:",null,null,"Race Finish Time :",null,{"$f":"D15","v":"00:00:00"},null,null,null,null,null,null,"Ctrl+Shift+R to formulate H/cap result."]
[]
["Start Mode:",null,{"$f":"IF(Schedule!C20=\"3b\",\"HANDICAP\",\"SCRATCH\")","v":"HANDICAP"}]
[null,"Non Starters:",0,"Non Finishers:",0]
[]
["Race Officer:",null,null,null,null,null,null,null,null,null,null,null,"Entrants",null,null,"Result"]
["Finish Placings","Recall #","Boat Name","Finish Time","Elapsed Time","Handicap","Corrected Time",{"$f":"IF(C10=\"Scratch\",\"H/cap Position\",\"Scratch Position\")","v":"Scratch Position"},null,null,null,"Recall #","Boat Name","H/CAP",null,"Scratch","H/Cap"]
[1,null,{"$f":"IF(ISBLANK(B15),\"\",VLOOKUP(B15,L$15:M$45,2))","v":""},null,{"$f":"IF(ISBLANK(D15),\"\",D15-C$8)","v":""},{"$f":"IF(ISBLANK(B15),\"\",VLOOKUP(B15,L$15:N$45,3))","v":""},{"$f":"IF(ISBLANK(D15),\"\",IF(C$10=\"Scratch\",E15-TIME(,F15,),E15))","v":""},null,1,null,null,1,null,null,null,null,null,15]
[2,null,"",null,"","","",null,2,null,null,2,null,null,null,null,null,10]
[3,null,"",null,"","","",null,3,null,null,3,null,null,null,null,null,3]
[4,null,"",null,"","","",null,4,null,null,4,null,null,null,null,null,2]
[5,null,"",null,"","","",null,5,null,null,5,null,null,null,null,null,8]
[6,null,"",null,"","","",null,6,null,null,6,null,null,null,null,null,12]
[7,null,"",null,"","","",null,7,null,null,7,null,null,null,null,null,14]
[8,null,"",null,"","","",null,8,null,null,8,null,null,null,null,null,1]
[9,null,"",null,"","","",null,9,null,null,9,null,null,null,null,null,4]
[10,null,"",null,"","","",null,10,null,null,10,null,null,null,null,null,11]
[11,null,"",null,"","","",null,11,null,null,11,null,null,null,null,null,9]
[12,null,"",null,"","","",null,12,null,null,12,null,null,null,null,null,5]
[13,null,"",null,"","","",null,13,null,null,13,null,null,null,null,null,6]
[14,null,"",null,"","","",null,14,null,null,14,null,null,null,null,null,7]
[15,null,"",null,"","","",null,15,null,null,15,null,null,null,null,null,13]
[16,null,"",null,"","","",null,16,null,null,16,null,null,null,null,null,17]
[17,null,"",null,"","","",null,17,null,null,17,null,null,null,null,null,16]
[18,null,"",null,"","","",null,18,null,null,18,null,null,null,null,null,30]
[19,null,"",null,"","","",null,19,null,null,19,null,null,null,null,null,18]
[20,null,"",null,"","","",null,20,null,null,20,null,null,null,null,null,18]
[21,null,"",null,"","","",null,21,null,null,21,null,null,null,null,null,18]
[22,null,"",null,"","","",null,22,null,null,22,null,null,null,null,null,18]
[23,null,"",null,"","","",null,23,null,null,23,null,null,null,null,null,18]
[24,null,"",null,"","","",null,24,null,null,null,null,null,null,null,null,18]
[25,null,"",null,"","","",null,25]
[26,null,"",null,"","","",null,26]
[27,null,"",null,"","","",null,27]
[28,null,"",null,"","","",null,28]
[29,null,"",null,"","","",null,29]
["Visitor",null,"CST",null,"","","",null,30]
[31,null,null,null,null,null,null,null,31]
[]
["Non Starters","Non Starters",null,"Non Finishers","Non Finishers"]
[]
[]
[]
[]
[]
[null,null,"Comments:"]
["Sailing Time:",null,{"$f":"E15","v":""}]
["Fastest Time:",null,{"$f":"C15","v":""}]
["Margins:","1st - 2nd",{"$f":"D16-D15","v":"00:00:00"}]
[null,"2nd - 3rd",{"$f":"D17-D16","v":"00:00:00"}]

{"sheet":"30-03-14","index":12,"n_rows":57,"n_cols":18,"rows_kept":57,"cut":false,"hidden":false,"merged":[[52,3,55,7],[53,0,53,1],[54,0,54,1],[49,0,49,2],[49,3,49,7],[51,3,51,7],[50,0,50,2],[50,3,50,7],[51,0,51,2],[48,0,48,2],[48,3,48,7],[12,15,12,16],[12,0,12,1],[12,4,12,6],[47,0,47,2],[47,3,47,7],[46,0,46,2],[46,3,46,7],[9,0,9,1],[0,0,0,7],[1,0,1,7],[3,0,3,1],[3,6,3,7],[7,0,7,1],[7,3,7,4],[7,5,7,7],[6,0,6,1]]}
["Australian 18 Footers League"]
["Starters and Judges Report"]
[]
["Name of Race:",null,{"$f":"Schedule!$D21","v":"Club Championship – Race 11"},"Entrants:",{"$f":"Schedule!G21","v":19},"Date:",{"$f":"Schedule!B21","v":"2014-03-30"}]
[null,null,{"$f":"Schedule!$E21","v":"Alice Burton Memorial Trophy"}]
[null,null,{"$f":"Schedule!$F21","v":" "}]
["Course:",null,null,"Wind:",null,"Tide:"]
["Race Start Time:",null,null,"Race Finish Time :",null,{"$f":"D15","v":"00:00:00"},null,null,null,null,null,null,"Ctrl+Shift+R to formulate H/cap result."]
[]
["Start Mode:",null,{"$f":"IF(Schedule!C21=\"3b\",\"HANDICAP\",\"SCRATCH\")","v":"SCRATCH"}]
[null,"Non Starters:",0,"Non Finishers:",0]
[]
["Race Officer:",null,null,null,null,null,null,null,null,null,null,null,"Entrants",null,null,"Result"]
["Finish Placings","Recall #","Boat Name","Finish Time","Elapsed Time","Handicap","Corrected Time",{"$f":"IF(C10=\"Scratch\",\"H/cap Position\",\"Scratch Position\")","v":"H/cap Position"},null,null,null,"Recall #","Boat Name","H/CAP",null,"Scratch","H/Cap"]
[1,null,{"$f":"IF(ISBLANK(B15),\"\",VLOOKUP(B15,L$15:M$45,2))","v":""},null,{"$f":"IF(ISBLANK(D15),\"\",D15-C$8)","v":""},{"$f":"IF(ISBLANK(B15),\"\",VLOOKUP(B15,L$15:N$45,3))","v":""},{"$f":"IF(ISBLANK(D15),\"\",IF(C$10=\"Scratch\",E15-TIME(,F15,),E15))","v":""},null,1,null,null,1,null,null,null,null,null,8]
[2,null,"",null,"","","",null,2,null,null,2,null,null,null,null,null,4]
[3,null,"",null,"","","",null,3,null,null,3,null,null,null,null,null,3]
[4,null,"",null,"","","",null,4,null,null,4,null,null,null,null,null,7]
[5,null,"",null,"","","",null,5,null,null,5,null,null,null,null,null,2]
[6,null,"",null,"","","",null,6,null,null,6,null,null,null,null,null,5]
[7,null,"",null,"","","",null,7,null,null,7,null,null,null,null,null,1]
[8,null,"",null,"","","",null,8,null,null,8,null,null,null,null,null,6]
[9,null,"",null,"","","",null,9,null,null,9,null,null,null,null,null,20]
[10,null,"",null,"","","",null,10,null,null,10,null,null,null,null,null,11]
[11,null,"",null,"","","",null,11,null,null,11,null,null,null,null,null,20]
[12,null,"",null,"","","",null,12,null,null,12,null,null,null,null,null,13]
[13,null,"",null,"","","",null,13,null,null,13,null,null,null,null,null,12]
[14,null,"",null,"","","",null,14,null,null,14,null,null,null,null,null,9]
[15,null,"",null,"","","",null,15,null,null,15,null,null,null,null,null,20]
[16,null,"",null,"","","",null,16,null,null,16,null,null,null,null,null,20]
[17,null,"",null,"","","",null,17,null,null,17,null,null,null,null,null,10]
[18,null,"",null,"","","",null,18,null,null,18,null,null,null,null,null,14]
[19,null,"",null,"","","",null,19,null,null,19,null,null,null,null,null,20]
[20,null,"",null,"","","",null,20,null,null,20,null,null,null,null,null,20]
[21,null,"",null,"","","",null,21,null,null,21,null,null,null,null,null,20]
[22,null,"",null,"","","",null,22,null,null,22,null,null,null,null,null,20]
[23,null,"",null,"","","",null,23,null,null,23,null,null,null,null,null,20]
[24,null,"",null,"","","",null,24,null,null,null,null,null,null,null,null,20]
[25,null,"",null,"","","",null,25]
[26,null,"",null,"","","",null,26]
[27,null,"",null,"","","",null,27]
[28,null,"",null,"","","",null,28]
[29,null,"",null,"","","",null,29]
[30,null,"",null,"","","",null,30]
[31,null,null,null,null,null,null,null,31]
[]
["Non Starters","Non Starters",null,"Non Finishers","Non Finishers"]
[]
[]
[]
[]
[]
[null,null,"Comments:"]
["Sailing Time:",null,{"$f":"E15","v":""}]
["Fastest Time:",null,{"$f":"C15","v":""}]
["Margins:","1st - 2nd",{"$f":"D16-D15","v":"00:00:00"}]
[null,"2nd - 3rd",{"$f":"D17-D16","v":"00:00:00"}]

{"sheet":"13-10-13","index":13,"n_rows":57,"n_cols":18,"rows_kept":57,"cut":false,"hidden":false,"merged":[[0,0,0,7],[1,0,1,7],[3,0,3,1],[3,6,3,7],[7,0,7,1],[7,3,7,4],[7,5,7,7],[6,0,6,1],[52,3,55,7],[53,0,53,1],[54,0,54,1],[47,0,47,2],[48,0,48,2],[9,0,9,1],[46,3,46,7],[48,3,48,7],[49,3,49,7],[46,0,46,2],[12,15,12,16],[12,0,12,1],[12,4,12,6],[51,3,51,7],[49,0,49,2],[50,0,50,2],[51,0,51,2],[47,3,47,7],[50,3,50,7]]}
["Australian 18 Footers League"]
["Starters and Judges Report"]
[]
["Name of Race:",null,{"$f":"Schedule!$D2","v":"3-buoy Challenge-Rnd 1 "},"Entrants:",{"$f":"Schedule!G2","v":19},"Date:",{"$f":"Schedule!B2","v":"2013-10-13"}]
[null,null,{"$f":"Schedule!$E2","v":"R. Watt Memorial Trophy"}]
[null,null,{"$f":"Schedule!$F2","v":" "},null,null,null,null,null,null,null,null,null,"Ctrl+Shift+R to formulate H/cap result."]
["Course:",null,null,"Wind:",null,"Tide:",null,null,null,null,null,null,"Ctrl+Shift+T to enter Finish Times"]
["Race Start Time:",null,null,"Race Finish Time :",null,{"$f":"D15","v":"00:00:00"}]
[]
["Start Mode:",null,"HANDICAP"]
[null,"Non Starters:",0,"Non Finishers:",0,null,null,0]
[]
["Starter:",null,null,"Judge:",null,null,null,null,null,null,null,null,"Entrants",null,null,"Result"]
["Finish Placings","Recall #","Boat Name","Finish Time","Elapsed Time","Handicap","Corrected Time",{"$f":"IF(C10=\"Scratch\",\"H/cap Position\",\"Scratch Position\")","v":"Scratch Position"},null,null,null,"Recall #","Boat Name","H/CAP",null,"Scratch","H/Cap"]
[1,8,{"$f":"IF(ISBLANK(B15),\"\",VLOOKUP(B15,L$15:M$45,2))","v":"SMEG"},null,{"$f":"IF(ISBLANK(D15),\"\",D15-C$8)","v":""},{"$f":"IF(ISBLANK(B15),\"\",VLOOKUP(B15,L$15:N$45,3))","v":0},{"$f":"IF(ISBLANK(D15),\"\",IF(C$10=\"Scratch\",E15-TIME(,F15,),E15))","v":""},1,1,null,null,1,"THURLOW FISHER LAWYERS",0,null,20,20,20]
[2,13,"RABBITOHS-KENWOOD",null,"",7,"",2,2,null,null,2,"YANDOO",4,null,20,20,20]
[3,null,"",null,"","","",3,3,null,null,3,"ASKO APPLIANCES",2,null,20,20,20]
[4,null,"",null,"","","",4,4,null,null,4,"DE’LONGHI-RABBITOHS",5,null,20,20,20]
[5,null,"",null,"","","",5,5,null,null,5,"APPLIANCESONLINE.COM.AU",3,null,20,20,20]
[6,null,"",null,"","","",6,6,null,null,6,"COOPERS 62-RAG & FAMISH HOTEL",1,null,20,20,20]
[7,null,"",null,"","","",7,7,null,null,7,"GOTTA LOVE IT 7",0,null,20,20,20]
[8,null,"",null,"","","",8,8,null,null,8,"SMEG",0,null,1,1,1]
[9,null,"",null,"","","",9,9,null,null,9,"PURE BLONDE",6,null,20,20,20]
[10,null,"",null,"","","",10,10,null,null,10,"FISHER & PAYKEL",0,null,20,20,20]
[11,null,"",null,"","","",11,11,null,null,11,"MOJO WINE",0,null,20,20,20]
[12,null,"",null,"","","",12,12,null,null,12,"LUMIX",7,null,20,20,20]
[13,null,"",null,"","","",13,13,null,null,13,"RABBITOHS-KENWOOD",7,null,2,2,2]
[14,null,"",null,"","","",14,14,null,null,14,"THE KITCHEN MAKER",6,null,20,20,20]
[15,null,"",null,"","","",15,15,null,null,15,"HAIER APPLIANCES",0,null,20,20,20]
[16,null,"",null,"","","",16,16,null,null,16,"SYDNEY CITY MARINE",0,null,20,20,20]
[17,null,"",null,"","","",17,17,null,null,17,"TBA",9,null,20,20,20]
[18,null,"",null,"","","",18,18,null,null,18,"DONNELLY",10,null,20,20,20]
[19,null,"",null,"","","",19,19,null,null,19,"SOUTHERN CROSS",10,null,20,20,20]
[20,null,"",null,"","","",20,20,null,null,20,null,null,null,20,20,20]
[21,null,"",null,"","","",21,21,null,null,21,null,null,null,20,20,20]
[22,null,"",null,"","","",22,22,null,null,22,null,null,null,20,20,20]
[23,null,"",null,"","","",23,23,null,null,23,null,null,null,20,20,20]
[24,null,"",null,"",null,"",24,24,null,null,null,null,null,null,20,20,20]
[25,null,"",null,"",{"$f":"IF(ISBLANK(B39),\"\",VLOOKUP(B39,L$15:N$45,3))","v":""},"",25,25,null,null,null,null,null,null,20,20]
[26,null,"",null,"","","",26,26,null,null,null,null,null,null,20,20]
[27,null,"",null,"","","",27,27,null,null,null,null,null,null,20,20]
[28,null,"",null,"","","",28,28,null,null,null,null,null,null,20,20]
[29,null,"",null,"","","",29,29,null,null,null,null,null,null,20,20]
[30,null,"",null,"","","",30,30,null,null,null,null,null,null,20,20]
[31,null,null,null,null,null,null,31,31,null,null,null,null,null,null,20,20]
[]
["Non Starters","Non Starters",null,"Non Finishers","Non Finishers"]
[]
[]
[]
[]
[]
[null,null,"Comments:"]
["Sailing Time:",null,{"$f":"E15","v":""}]
["Fastest Time:",null,{"$f":"C15","v":"SMEG"}]
["Margins:","1st - 2nd",{"$f":"D16-D15","v":"00:00:00"}]
[null,"2nd - 3rd",{"$f":"D17-D16","v":"00:00:00"}]

{"sheet":"20-10-13","index":14,"n_rows":57,"n_cols":18,"rows_kept":57,"cut":false,"hidden":false,"merged":[[12,15,12,16],[50,3,50,7],[48,0,48,2],[46,0,46,2],[46,3,46,7],[47,3,47,7],[48,3,48,7],[12,0,12,1],[9,0,9,1],[52,3,55,7],[53,0,53,1],[54,0,54,1],[49,0,49,2],[49,3,49,7],[50,0,50,2],[51,0,51,2],[51,3,51,7],[47,0,47,2],[0,0,0,7],[1,0,1,7],[3,0,3,1],[3,6,3,7],[7,0,7,1],[7,3,7,4],[7,5,7,7],[6,0,6,1]]}
["Australian 18 Footers League"]
["Starters and Judges Report"]
[]
["Name of Race:",null,{"$f":"Schedule!D3","v":"3-buoy Challenge-Rnd 2"},"Entrants:",{"$f":"Schedule!G3","v":19},"Date:",{"$f":"Schedule!B3","v":"2013-10-20"}]
[null,null,{"$f":"Schedule!$E3","v":"Major A. Frizelle Trophy"}]
[null,null,{"$f":"Schedule!$F3","v":" "},null,null,null,null,null,null,null,null,null,"Ctrl+Shift+R to formulate H/cap result."]
["Course:",null,"6/3","Wind:","10kts NE","Tide:","Ebb",null,null,null,null,null,"Ctrl+Shift+T to enter Finish Times"]
["Race Start Time:",null,"14:40:00","Race Finish Time :",null,{"$f":"D15","v":"15:52:46"}]
[]
["Start Mode:",null,"HANDICAP"]
[null,"Non Starters:",3,"Non Finishers:",1,null,null,0]
[]
["Race Officer:",null,"Pam Scrivenor",null,null,null,null,null,null,null,null,null,"Entrants",null,null,"Result"]
["Finish Placings","Recall #","Boat Name","Finish Time","Elapsed Time","Handicap","Corrected Time",{"$f":"IF(C10=\"Scratch\",\"H/cap Position\",\"Scratch Position\")","v":"Scratch Position"},null,null,null,"Recall #","Boat Name","H/CAP",null,"Scratch","H/Cap"]
[1,12,{"$f":"IF(ISBLANK(B15),\"\",VLOOKUP(B15,L$15:M$45,2))","v":"LUMIX"},"15:52:46",{"$f":"IF(ISBLANK(D15),\"\",D15-C$8)","v":"01:12:46"},{"$f":"IF(ISBLANK(B15),\"\",VLOOKUP(B15,L$15:N$45,3))","v":5},{"$f":"IF(ISBLANK(D15),\"\",IF(C$10=\"Scratch\",E15-TIME(,F15,),E15))","v":"01:12:46"},1,1,null,null,1,"THURLOW FISHER LAWYERS",1,null,7,7,7]
[2,2,"YANDOO","15:53:42","01:13:42",3,"01:13:42",2,2,null,null,2,"YANDOO",3,null,2,2,2]
[3,11,"MOJO WINE","15:54:56","01:14:56",0,"01:14:56",3,3,null,null,3,"ASKO APPLIANCES",3,null,4,4,4]
[4,3,"ASKO APPLIANCES","15:55:23","01:15:23",3,"01:15:23",4,4,null,null,4,"DE’LONGHI-RABBITOHS",6,null,5,5,5]
[5,4,"DE’LONGHI-RABBITOHS","15:55:34","01:15:34",6,"01:15:34",5,5,null,null,5,"APPLIANCESONLINE.COM.AU",3,null,20,20,20]
[6,14,"THE KITCHEN MAKER","15:56:06","01:16:06",7,"01:16:06",6,6,null,null,6,"COOPERS 62-RAG & FAMISH HOTEL",1,null,20,20,20]
[7,1,"THURLOW FISHER LAWYERS","15:56:28","01:16:28",1,"01:16:28",7,7,null,null,7,"GOTTA LOVE IT 7",0,null,20,20,20]
[8,9,"PURE BLONDE","15:56:39","01:16:39",7,"01:16:39",8,8,null,null,8,"SMEG",1,null,11,11,11]
[9,10,"FISHER & PAYKEL","15:58:26","01:18:26",1,"01:18:26",9,9,null,null,9,"PURE BLONDE",7,null,8,8,8]
[10,13,"RABBITOHS-KENWOOD","16:01:22","01:21:22",9,"01:21:22",10,10,null,null,10,"FISHER & PAYKEL",1,null,9,9,9]
[11,8,"SMEG","16:04:16","01:24:16",1,"01:24:16",11,11,null,null,11,"MOJO WINE",0,null,3,3,3]
[12,15,"HAIER APPLIANCES","16:05:08","01:25:08",1,"01:25:08",12,12,null,null,12,"LUMIX",5,null,1,1,1]
[13,16,"SYDNEY CITY MARINE","16:06:46","01:26:46",0,"01:26:46",13,13,null,null,13,"RABBITOHS-KENWOOD",9,null,10,10,10]
[14,19,"SOUTHERN CROSS","16:14:18","01:34:18",10,"01:34:18",14,14,null,null,14,"THE KITCHEN MAKER",7,null,6,6,6]
[15,17,"TEAM PEDRO","16:23:13","01:43:13",10,"01:43:13",15,15,null,null,15,"HAIER APPLIANCES",1,null,12,12,12]
[16,null,"",null,"","","",16,16,null,null,16,"SYDNEY CITY MARINE",0,null,13,13,13]
[17,null,"",null,"","","",17,17,null,null,17,"TEAM PEDRO",10,null,15,15,15]
[18,null,"",null,"","","",18,18,null,null,18,"DONNELLY",10,null,20,20,20]
[19,null,"",null,"","","",19,19,null,null,19,"SOUTHERN CROSS",10,null,14,14,14]
[20,null,"",null,"","","",20,20,null,null,20,null,null,null,20,20,20]
[21,null,"",null,"","","",21,21,null,null,21,null,null,null,20,20,20]
[22,null,"",null,"","","",22,22,null,null,22,null,null,null,20,20,20]
[23,null,"",null,"","","",23,23,null,null,23,null,null,null,20,20,20]
[24,null,"",null,"","","",24,24,null,null,null,null,null,null,20,20,20]
[25,null,"",null,"","","",25,25,null,null,null,null,null,null,20,20]
[26,null,"",null,"","","",26,26,null,null,null,null,null,null,20,20]
[27,null,"",null,"","","",27,27,null,null,null,null,null,null,20,20]
[28,null,"",null,"","","",28,28,null,null,null,null,null,null,20,20]
[29,null,"",null,"","","",29,29,null,null,null,null,null,null,20,20]
[30,null,"",null,"","","",30,30,null,null,null,null,null,null,20,20]
[31,null,null,null,null,null,null,31,31,null,null,null,null,null,null,20,20]
[]
["Non Starters","Non Starters",null,"Non Finishers","Non Finishers"]
["Gotta Love It 7",null,null,"Team Donnelly"]
["Coopers62-Rag & Famish Hotel"]
["Appliancesonline.com.au"]
[]
[]
[null,null,"Comments:"]
["Sailing Time:",null,{"$f":"E15","v":"01:12:46"}]
["Fastest Time:",null,{"$f":"C15","v":"LUMIX"}]
["Margins:","1st - 2nd",{"$f":"D16-D15","v":"00:00:56"}]
[null,"2nd - 3rd",{"$f":"D17-D16","v":"00:01:14"}]

{"sheet":"27-10-13","index":15,"n_rows":57,"n_cols":18,"rows_kept":57,"cut":false,"hidden":false,"merged":[[51,3,51,7],[54,0,54,1],[49,0,49,2],[52,3,55,7],[53,0,53,1],[49,3,49,7],[50,0,50,2],[50,3,50,7],[51,0,51,2],[12,15,12,16],[12,0,12,1],[0,0,0,7],[1,0,1,7],[3,0,3,1],[3,6,3,7],[7,0,7,1],[7,3,7,4],[7,5,7,7],[6,0,6,1],[48,0,48,2],[48,3,48,7],[9,0,9,1],[46,0,46,2],[46,3,46,7],[47,0,47,2],[47,3,47,7]]}
["Australian 18 Footers League"]
["Starters and Judges Report"]
[]
["Name of Race:",null,{"$f":"Schedule!$D4","v":"3-buoy Challenge-Rnd 3 "},"Entrants:",{"$f":"Schedule!G4","v":19},"Date:",{"$f":"Schedule!B4","v":"2013-10-27"}]
[null,null,{"$f":"Schedule!$E4","v":"Chris Webb Memorial Trophy"}]
[null,null,{"$f":"Schedule!$F4","v":" "},null,null,null,null,null,null,null,null,null,"Ctrl+Shift+R to formulate H/cap result."]
["Course:",null,"6/3","Wind:","8-10 E","Tide:","Full",null,null,null,null,null,"Ctrl+Shift+T to enter Finish Times"]
["Race Start Time:",null,"14:48:00","Race Finish Time :",null,{"$f":"D15","v":"15:59:04"}]
[]
["Start Mode:",null,"HANDICAP"]
[null,"Non Starters:",3,"Non Finishers:",2,null,null,0]
[]
["Race Officer:",null,null,null,null,null,null,null,null,null,null,null,"Entrants",null,null,"Result"]
["Finish Placings","Recall #","Boat Name","Finish Time","Elapsed Time","Handicap","Corrected Time",{"$f":"IF(C10=\"Scratch\",\"H/cap Position\",\"Scratch Position\")","v":"Scratch Position"},null,null,null,"Recall #","Boat Name","H/CAP",null,"Scratch","H/Cap"]
[1,12,{"$f":"IF(ISBLANK(B15),\"\",VLOOKUP(B15,L$15:M$45,2))","v":"LUMIX"},"15:59:04",{"$f":"IF(ISBLANK(D15),\"\",D15-C$8)","v":"01:11:04"},{"$f":"IF(ISBLANK(B15),\"\",VLOOKUP(B15,L$15:N$45,3))","v":5},{"$f":"IF(ISBLANK(D15),\"\",IF(C$10=\"Scratch\",E15-TIME(,F15,),E15))","v":"01:11:04"},1,1,null,null,1,"THURLOW FISHER LAWYERS",1,null,4,4,4]
[2,8,"SMEG","16:01:28","01:13:28",1,"01:13:28",2,2,null,null,2,"YANDOO",3,null,6,6,6]
[3,10,"FISHER & PAYKEL","16:02:35","01:14:35",1,"01:14:35",3,3,null,null,3,"ASKO APPLIANCES",3,null,20,20,20]
[4,1,"THURLOW FISHER LAWYERS","16:02:53","01:14:53",1,"01:14:53",4,4,null,null,4,"DE’LONGHI-RABBITOHS",6,null,9,9,9]
[5,13,"RABBITOHS-KENWOOD","16:03:31","01:15:31",9,"01:15:31",5,5,null,null,5,"APPLIANCESONLINE.COM.AU",3,null,20,20,20]
[6,2,"YANDOO","16:04:10","01:16:10",3,"01:16:10",6,6,null,null,6,"COOPERS 62-RAG & FAMISH HOTEL",1,null,20,20,20]
[7,11,"MOJO WINE","16:05:03","01:17:03",0,"01:17:03",7,7,null,null,7,"GOTTA LOVE IT 7",0,null,20,20,20]
[8,15,"HAIER APPLIANCES","16:05:25","01:17:25",1,"01:17:25",8,8,null,null,8,"SMEG",1,null,2,2,2]
[9,4,"DE’LONGHI-RABBITOHS","16:07:03","01:19:03",6,"01:19:03",9,9,null,null,9,"PURE BLONDE",7,null,10,10,10]
[10,9,"PURE BLONDE","16:07:44","01:19:44",7,"01:19:44",10,10,null,null,10,"FISHER & PAYKEL",1,null,3,3,3]
[11,17,"TEAM PEDRO","16:12:02","01:24:02",10,"01:24:02",11,11,null,null,11,"MOJO WINE",0,null,7,7,7]
[12,19,"SOUTHERN CROSS","16:13:22","01:25:22",10,"01:25:22",12,12,null,null,12,"LUMIX",5,null,1,1,1]
[13,18,"DONNELLY","16:16:21","01:28:21",10,"01:28:21",13,13,null,null,13,"RABBITOHS-KENWOOD",9,null,5,5,5]
[14,14,"THE KITCHEN MAKER","16:18:28","01:30:28",7,"01:30:28",14,14,null,null,14,"THE KITCHEN MAKER",7,null,14,14,14]
[15,null,"",null,"","","",15,15,null,null,15,"HAIER APPLIANCES",1,null,8,8,8]
[16,null,"",null,"","","",16,16,null,null,16,"SYDNEY CITY MARINE",0,null,20,20,20]
[17,null,"",null,"","","",17,17,null,null,17,"TEAM PEDRO",10,null,11,11,11]
[18,null,"",null,"","","",18,18,null,null,18,"DONNELLY",10,null,13,13,13]
[19,null,"",null,"","","",19,19,null,null,19,"SOUTHERN CROSS",10,null,12,12,12]
[20,null,"",null,"","","",20,20,null,null,20,null,null,null,20,20,20]
[21,null,"",null,"","","",21,21,null,null,21,null,null,null,20,20,20]
[22,null,"",null,"","","",22,22,null,null,22,null,null,null,20,20,20]
[23,null,"",null,"","","",23,23,null,null,23,null,null,null,20,20,20]
[24,null,"",null,"","","",24,24,null,null,null,null,null,null,20,20,20]
[25,null,"",null,"","","",25,25,null,null,null,null,null,null,20,20]
[26,null,"",null,"","","",26,26,null,null,null,null,null,null,20,20]
[27,null,"",null,"","","",27,27,null,null,null,null,null,null,20,20]
[28,null,"",null,"","","",28,28,null,null,null,null,null,null,20,20]
[29,null,"",null,"","","",29,29,null,null,null,null,null,null,20,20]
[30,null,"",null,"","","",30,30,null,null,null,null,null,null,20,20]
[31,null,null,null,null,null,null,31,31,null,null,null,null,null,null,20,20]
[]
["Non Starters","Non Starters",null,"Non Finishers","Non Finishers"]
["Gotta Love It 7",null,null,"Asko Appliances"]
["Coopers 62-Rag & Famish Hotel",null,null,"Sydney City Marine"]
["Appliancesonline.com.au"]
[]
[]
[null,null,"Comments:"]
["Sailing Time:",null,{"$f":"E15","v":"01:11:04"}]
["Fastest Time:",null,{"$f":"C15","v":"LUMIX"}]
["Margins:","1st - 2nd",{"$f":"D16-D15","v":"00:02:24"}]
[null,"2nd - 3rd",{"$f":"D17-D16","v":"00:01:07"}]

{"sheet":"3-11-13","index":16,"n_rows":57,"n_cols":18,"rows_kept":57,"cut":false,"hidden":false,"merged":[[52,3,55,7],[53,0,53,1],[54,0,54,1],[49,0,49,2],[49,3,49,7],[51,3,51,7],[50,0,50,2],[50,3,50,7],[51,0,51,2],[0,0,0,7],[1,0,1,7],[3,0,3,1],[3,6,3,7],[7,0,7,1],[7,3,7,4],[7,5,7,7],[6,0,6,1],[9,0,9,1],[48,0,48,2],[48,3,48,7],[12,15,12,16],[12,0,12,1],[12,4,12,6],[47,0,47,2],[47,3,47,7],[46,3,46,7],[46,0,46,2]]}
["Australian 18 Footers League"]
["Starters and Judges Report"]
[]
["Name of Race:",null,{"$f":"Schedule!$D5","v":"3-buoy Challenge-Rnd 4 "},"Entrants:",{"$f":"Schedule!G5","v":19},"Date:",{"$f":"Schedule!B5","v":"2013-11-03"}]
[null,null,{"$f":"Schedule!$E5","v":"Mick Scully Memorial Trophy"}]
[null,null,{"$f":"Schedule!$F5","v":" "},null,null,null,null,null,null,null,null,null,"Ctrl+Shift+R to formulate H/cap result."]
["Course:",null,"6/3","Wind:",null,"Tide:"]
["Race Start Time:",null,null,"Race Finish Time :",null,{"$f":"D15","v":"00:00:00"}]
[]
["Start Mode:",null,{"$f":"IF(Schedule!C5=\"3b\",\"HANDICAP\",\"SCRATCH\")","v":"HANDICAP"}]
[null,"Non Starters:",0,"Non Finishers:",0,null,null,0]
[]
["Race Officer:",null,null,null,null,null,null,null,null,null,null,null,"Entrants",null,null,"Result"]
["Finish Placings","Recall #","Boat Name","Finish Time","Elapsed Time","Handicap","Corrected Time",{"$f":"IF(C10=\"Scratch\",\"H/cap Position\",\"Scratch Position\")","v":"Scratch Position"},null,null,null,"Recall #","Boat Name","H/CAP",null,"Scratch","H/Cap"]
[1,null,{"$f":"IF(ISBLANK(B15),\"\",VLOOKUP(B15,L$15:M$45,2))","v":""},null,{"$f":"IF(ISBLANK(D15),\"\",D15-C$8)","v":""},{"$f":"IF(ISBLANK(B15),\"\",VLOOKUP(B15,L$15:N$45,3))","v":""},{"$f":"IF(ISBLANK(D15),\"\",IF(C$10=\"Scratch\",E15-TIME(,F15,),E15))","v":""},null,1,null,null,1,"THURLOW FISHER LAWYERS",2,null,null,null,3]
[2,null,"",null,"","","",null,2,null,null,2,"YANDOO",4,null,null,null,12]
[3,null,"",null,"","","",null,3,null,null,3,"ASKO APPLIANCES",4,null,null,null,9]
[4,null,"",null,"","","",null,4,null,null,4,"DE’LONGHI-RABBITOHS",7,null,null,null,6]
[5,null,"",null,"","","",null,5,null,null,5,"APPLIANCESONLINE.COM.AU",3,null,null,null,2]
[6,null,"",null,"","","",null,6,null,null,6,"COOPERS 62-RAG & FAMISH HOTEL",1,null,null,null,14]
[7,null,"",null,"","","",null,7,null,null,7,"GOTTA LOVE IT 7",0,null,null,null,1]
[8,null,"",null,"","","",null,8,null,null,8,"SMEG",0,null,null,null,7]
[9,null,"",null,"","","",null,9,null,null,9,"PURE BLONDE",8,null,null,null,11]
[10,null,"",null,"","","",null,10,null,null,10,"FISHER & PAYKEL",1,null,null,null,4]
[11,null,"",null,"","","",null,11,null,null,11,"MOJO WINE",1,null,null,null,5]
[12,null,"",null,"","","",null,12,null,null,12,"LUMIX",3,null,null,null,13]
[13,null,"",null,"","","",null,13,null,null,13,"RABBITOHS-KENWOOD",10,null,null,null,10]
[14,null,"",null,"","","",null,14,null,null,14,"THE KITCHEN MAKER",8,null,null,null,8]
[15,null,"",null,"","","",null,15,null,null,15,"HAIER APPLIANCES",2,null,null,null,20]
[16,null,"",null,"","","",null,16,null,null,16,"SYDNEY CITY MARINE",1,null,null,null,20]
[17,null,"",null,"","","",null,17,null,null,17,"TEAM PEDRO",10,null,null,null,20]
[18,null,"",null,"","","",null,18,null,null,18,"VIAGOGO",10,null,null,null,20]
[19,null,"",null,"","","",null,19,null,null,19,"SOUTHERN CROSS",10,null,null,null,15]
[20,null,"",null,"","","",null,20,null,null,20,null,null,null,null,null,20]
[21,null,"",null,"","","",null,21,null,null,21,null,null,null,null,null,20]
[22,null,"",null,"","","",null,22,null,null,22,null,null,null,null,null,20]
[23,null,"",null,"","","",null,23,null,null,23,null,null,null,null,null,20]
[24,null,"",null,"","","",null,24,null,null,null,null,null,null,null,null,20]
[25,null,"",null,"","","",null,25]
[26,null,"",null,"","","",null,26]
[27,null,"",null,"","","",null,27]
[28,null,"",null,"","","",null,28]
[29,null,"",null,"","","",null,29]
[30,null,"",null,"","","",null,30]
[null,null,null,null,"",null,null,null,31]
[]
["Non Starters","Non Starters",null,"Non Finishers","Non Finishers"]
[]
[]
[]
[]
[]
[null,null,"Comments:"]
["Sailing Time:",null,{"$f":"E15","v":""}]
["Fastest Time:",null,{"$f":"C15","v":""}]
["Margins:","1st - 2nd",{"$f":"D16-D15","v":"00:00:00"}]
[null,"2nd - 3rd",{"$f":"D17-D16","v":"00:00:00"}]

{"sheet":"10-11-13","index":17,"n_rows":57,"n_cols":18,"rows_kept":57,"cut":false,"hidden":false,"merged":[[49,3,49,7],[51,3,51,7],[50,0,50,2],[50,3,50,7],[51,0,51,2],[12,15,12,16],[47,0,47,2],[47,3,47,7],[46,3,46,7],[12,0,12,1],[12,4,12,6],[52,3,59,7],[48,0,48,2],[48,3,48,7],[6,0,6,1],[0,0,0,7],[1,0,1,7],[3,0,3,1],[3,6,3,7],[7,0,7,1],[7,3,7,4],[7,5,7,7],[46,0,46,2],[9,0,9,1],[53,0,53,1],[54,0,54,1],[49,0,49,2]]}
["Australian 18 Footers League"]
["Starters and Judges Report"]
[]
["Name of Race:",null,{"$f":"Schedule!$D6","v":"NSW Championship – Race 1"},"Entrants:",{"$f":"Schedule!G6","v":19},"Date:",{"$f":"Schedule!B6","v":"2013-11-10"}]
[null,null,{"$f":"Schedule!$E6","v":"Club Championship – Race 1"}]
[null,null,{"$f":"Schedule!$F6","v":"W.C. ‘Trappy’ Duncan Memorial Trophy"},null,null,null,null,null,null,null,null,null,"Ctrl+Shift+R to formulate H/cap result."]
["Course:",null,3,"Wind:","SE15-18","Tide:","Ebbing"]
["Race Start Time:",null,"14:45:00","Race Finish Time :",null,{"$f":"D15","v":"15:53:56"}]
[]
["Start Mode:",null,{"$f":"IF(Schedule!C6=\"3b\",\"HANDICAP\",\"SCRATCH\")","v":"SCRATCH"}]
[null,"Non Starters:",2,"Non Finishers:",1]
[]
["Race Officer:",null,"Doug Cameron",null,null,null,null,null,null,null,null,null,"Entrants",null,null,"Result"]
["Finish Placings","Recall #","Boat Name","Finish Time","Elapsed Time","Handicap","Corrected Time",{"$f":"IF(C10=\"Scratch\",\"H/cap Position\",\"Scratch Position\")","v":"H/cap Position"},null,null,null,"Recall #","Boat Name","H/CAP",null,"Scratch","H/Cap"]
[1,7,{"$f":"IF(ISBLANK(B15),\"\",VLOOKUP(B15,L$15:M$45,2))","v":"GOTTA LOVE IT 7"},"15:53:56",{"$f":"IF(ISBLANK(D15),\"\",D15-C$8)","v":"01:08:56"},{"$f":"IF(ISBLANK(B15),\"\",VLOOKUP(B15,L$15:N$45,3))","v":0},{"$f":"IF(ISBLANK(D15),\"\",IF(C$10=\"Scratch\",E15-TIME(,F15,),E15))","v":"01:08:56"},3,1,null,null,1,"THURLOW FISHER LAWYERS",2,null,2,4,2]
[2,1,"THURLOW FISHER LAWYERS","15:56:50","01:11:50",2,"01:09:50",4,2,null,null,2,"YANDOO",4,null,12,13,12]
[3,8,"SMEG","15:57:52","01:12:52",0,"01:12:52",10,3,null,null,3,"ASKO APPLIANCES",4,null,11,12,11]
[4,16,"SYDNEY CITY MARINE","15:58:38","01:13:38",1,"01:12:38",9,4,null,null,4,"DE’LONGHI-RABBITOHS",7,null,13,8,13]
[5,5,"APPLIANCESONLINE.COM.AU","15:58:54","01:13:54",3,"01:10:54",5,5,null,null,5,"APPLIANCESONLINE.COM.AU",3,null,5,5,5]
[6,12,"LUMIX","15:59:03","01:14:03",3,"01:11:03",7,6,null,null,6,"COOPERS 62-RAG & FAMISH HOTEL",1,null,9,14,9]
[7,10,"FISHER & PAYKEL","15:59:35","01:14:35",1,"01:13:35",11,7,null,null,7,"GOTTA LOVE IT 7",0,null,1,3,1]
[8,13,"RABBITOHS-KENWOOD","16:00:28","01:15:28",10,"01:05:28",1,8,null,null,8,"SMEG",0,null,3,10,3]
[9,6,"COOPERS 62-RAG & FAMISH HOTEL","16:00:31","01:15:31",1,"01:14:31",14,9,null,null,9,"PURE BLONDE",8,null,10,2,10]
[10,9,"PURE BLONDE","16:01:12","01:16:12",8,"01:08:12",2,10,null,null,10,"FISHER & PAYKEL",1,null,7,11,7]
[11,3,"ASKO APPLIANCES","16:02:45","01:17:45",4,"01:13:45",12,11,null,null,11,"MOJO WINE",1,null,20,20,20]
[12,2,"YANDOO","16:03:17","01:18:17",4,"01:14:17",13,12,null,null,12,"LUMIX",3,null,6,7,6]
[13,4,"DE’LONGHI-RABBITOHS","16:03:27","01:18:27",7,"01:11:27",8,13,null,null,13,"RABBITOHS-KENWOOD",10,null,8,1,8]
[14,14,"THE KITCHEN MAKER","16:03:56","01:18:56",8,"01:10:56",6,14,null,null,14,"THE KITCHEN MAKER",8,null,14,6,14]
[15,15,"HAIER APPLIANCES","16:06:31","01:21:31",2,"01:19:31",15,15,null,null,15,"HAIER APPLIANCES",2,null,15,15,15]
[16,17,"TEAM PEDRO","16:15:11","01:30:11",10,"01:20:11",16,16,null,null,16,"SYDNEY CITY MARINE",1,null,4,9,4]
[17,null,"",null,"","","",17,17,null,null,17,"TEAM PEDRO",10,null,16,16,16]
[18,null,"",null,"","","",18,18,null,null,18,"VIAGOGO",10,null,20,20,20]
[19,null,"",null,"","","",19,19,null,null,19,"SOUTHERN CROSS",10,null,20,20,20]
[20,null,"",null,"","","",20,20,null,null,20,null,null,null,20,20,20]
[21,null,"",null,"","","",21,21,null,null,21,null,null,null,20,20,20]
[22,null,"",null,"","","",22,22,null,null,22,null,null,null,20,20,20]
[23,null,"",null,"","","",23,23,null,null,23,null,null,null,20,20,20]
[24,null,"",null,"",null,"",24,24,null,null,null,null,null,null,20,20,20]
[25,null,"",null,"",{"$f":"IF(ISBLANK(B39),\"\",VLOOKUP(B39,L$15:N$45,3))","v":""},"",25,25,null,null,null,null,null,null,20,20]
[26,null,"",null,"","","",26,26,null,null,null,null,null,null,20,20]
[27,null,"",null,"","","",27,27,null,null,null,null,null,null,20,20]
[28,null,"",null,"","","",28,28,null,null,null,null,null,null,20,20]
[29,null,"",null,"","","",29,29,null,null,null,null,null,null,20,20]
[30,null,"",null,"","","",30,30,null,null,null,null,null,null,20,20]
[null,null,null,null,"",null,null,31,31,null,null,null,null,null,null,20,20]
[]
["Non Starters","Non Starters",null,"Non Finishers","Non Finishers"]
["Mojo Wines",null,null,"Viagogo"]
["Southern Cross"]
[]
[]
[]
[null,null,"Comments:"]
["Sailing Time:",null,{"$f":"E15","v":"01:08:56"}]
["Fastest Time:",null,{"$f":"C15","v":"GOTTA LOVE IT 7"}]
["Margins:","1st - 2nd",{"$f":"D16-D15","v":"00:02:54"}]
[null,"2nd - 3rd",{"$f":"D17-D16","v":"00:01:02"}]

{"sheet":"17-11-13","index":18,"n_rows":57,"n_cols":18,"rows_kept":57,"cut":false,"hidden":false,"merged":[[52,3,55,7],[53,0,53,1],[54,0,54,1],[49,0,49,2],[49,3,49,7],[51,3,51,7],[50,0,50,2],[50,3,50,7],[51,0,51,2],[0,0,0,7],[1,0,1,7],[3,0,3,1],[3,6,3,7],[7,0,7,1],[7,3,7,4],[7,5,7,7],[6,0,6,1],[9,0,9,1],[48,0,48,2],[48,3,48,7],[12,15,12,16],[12,0,12,1],[12,4,12,6],[47,0,47,2],[47,3,47,7],[46,3,46,7],[46,0,46,2]]}
["Australian 18 Footers League"]
["Starters and Judges Report"]
[]
["Name of Race:",null,{"$f":"Schedule!$D7","v":"3-buoy Challenge-Rnd 5 "},"Entrants:",{"$f":"Schedule!G7","v":19},"Date:",{"$f":"Schedule!B7","v":"2013-11-17"}]
[null,null,{"$f":"Schedule!$E7","v":""}]
[null,null,{"$f":"Schedule!$F7","v":""},null,null,null,null,null,null,null,null,null,"Ctrl+Shift+R to formulate H/cap result."]
["Course:",null,"6/3","Wind:","S 15-18","Tide:"]
["Race Start Time:",null,"14:55:00","Race Finish Time :",null,{"$f":"D15","v":"15:50:33"}]
[]
["Start Mode:",null,{"$f":"IF(Schedule!C7=\"3b\",\"HANDICAP\",\"SCRATCH\")","v":"HANDICAP"}]
[null,"Non Starters:",0,"Non Finishers:",4,null,null,0]
[]
["Race Officer:",null,"Doug Cameron",null,null,null,null,null,null,null,null,null,"Entrants",null,null,"Result"]
["Finish Placings","Recall #","Boat Name","Finish Time","Elapsed Time","Handicap","Corrected Time",{"$f":"IF(C10=\"Scratch\",\"H/cap Position\",\"Scratch Position\")","v":"Scratch Position"},null,null,null,"Recall #","Boat Name","H/CAP",null,"Scratch","H/Cap"]
[1,1,{"$f":"IF(ISBLANK(B15),\"\",VLOOKUP(B15,L$15:M$45,2))","v":"THURLOW FISHER LAWYERS"},"15:50:33",{"$f":"IF(ISBLANK(D15),\"\",D15-C$8)","v":"00:55:33"},{"$f":"IF(ISBLANK(B15),\"\",VLOOKUP(B15,L$15:N$45,3))","v":3},{"$f":"IF(ISBLANK(D15),\"\",IF(C$10=\"Scratch\",E15-TIME(,F15,),E15))","v":"00:55:33"},1,1,null,null,1,"THURLOW FISHER LAWYERS",3,null,1,1,1]
[2,5,"APPLIANCESONLINE.COM.AU","15:51:08","00:56:08",4,"00:56:08",2,2,null,null,2,"YANDOO",5,null,5,5,5]
[3,12,"LUMIX","15:52:09","00:57:09",4,"00:57:09",3,3,null,null,3,"ASKO APPLIANCES",5,null,11,11,11]
[4,14,"THE KITCHEN MAKER","15:52:20","00:57:20",9,"00:57:20",4,4,null,null,4,"DE’LONGHI-RABBITOHS",8,null,10,10,10]
[5,2,"YANDOO","15:53:41","00:58:41",5,"00:58:41",5,5,null,null,5,"APPLIANCESONLINE.COM.AU",4,null,2,2,2]
[6,6,"COOPERS 62-RAG & FAMISH HOTEL","15:53:51","00:58:51",2,"00:58:51",6,6,null,null,6,"COOPERS 62-RAG & FAMISH HOTEL",2,null,6,6,6]
[7,10,"FISHER & PAYKEL","15:53:55","00:58:55",2,"00:58:55",7,7,null,null,7,"GOTTA LOVE IT 7",0,null,20,20,20]
[8,11,"MOJO WINE","15:54:01","00:59:01",1,"00:59:01",8,8,null,null,8,"SMEG",1,null,12,12,12]
[9,15,"HAIER APPLIANCES","15:55:30","01:00:30",3,"01:00:30",9,9,null,null,9,"PURE BLONDE",7,null,20,20,20]
[10,4,"DE’LONGHI-RABBITOHS","15:56:22","01:01:22",8,"01:01:22",10,10,null,null,10,"FISHER & PAYKEL",2,null,7,7,7]
[11,3,"ASKO APPLIANCES","15:57:21","01:02:21",5,"01:02:21",11,11,null,null,11,"MOJO WINE",1,null,8,8,8]
[12,8,"SMEG","15:58:12","01:03:12",1,"01:03:12",12,12,null,null,12,"LUMIX",4,null,3,3,3]
[13,13,"RABBITOHS-KENWOOD","15:59:09","01:04:09",8,"01:04:09",13,13,null,null,13,"RABBITOHS-KENWOOD",8,null,13,13,13]
[14,19,"SOUTHERN CROSS","16:01:50","01:06:50",10,"01:06:50",14,14,null,null,14,"THE KITCHEN MAKER",9,null,4,4,4]
[15,17,"TEAM PEDRO","16:06:33","01:11:33",10,"01:11:33",15,15,null,null,15,"HAIER APPLIANCES",3,null,9,9,9]
[16,null,"",null,"","","",16,16,null,null,16,"SYDNEY CITY MARINE",2,null,20,20,20]
[17,null,"",null,"","","",17,17,null,null,17,"TEAM PEDRO",10,null,15,15,15]
[18,null,"",null,"","","",18,18,null,null,18,"VIAGOGO",10,null,20,20,20]
[19,null,"",null,"","","",19,19,null,null,19,"SOUTHERN CROSS",10,null,14,14,14]
[20,null,"",null,"","","",20,20,null,null,20,null,null,null,20,20,20]
[21,null,"",null,"","","",21,21,null,null,21,null,null,null,20,20,20]
[22,null,"",null,"","","",22,22,null,null,22,null,null,null,20,20,20]
[23,null,"",null,"","","",23,23,null,null,23,null,null,null,20,20,20]
[24,null,"",null,"","","",24,24,null,null,null,null,null,null,20,20,20]
[25,null,"",null,"","","",25,25,null,null,null,null,null,null,20,20]
[26,null,"",null,"","","",26,26,null,null,null,null,null,null,20,20]
[27,null,"",null,"","","",27,27,null,null,null,null,null,null,20,20]
[28,null,"",null,"","","",28,28,null,null,null,null,null,null,20,20]
[29,null,"",null,"","","",29,29,null,null,null,null,null,null,20,20]
[30,null,"",null,"","","",30,30,null,null,null,null,null,null,20,20]
[null,null,null,null,"",null,null,31,31,null,null,null,null,null,null,20,20]
[]
["Non Starters","Non Starters",null,"Non Finishers","Non Finishers"]
[null,null,null,"Viagogo"]
[null,null,null,"Sydney City Marine"]
[null,null,null,"Gotta Love It 7 - OCS 15:48.53"]
[null,null,null,"Pure Blonde - OCS"]
[]
[null,null,"Comments:"]
["Sailing Time:",null,{"$f":"E15","v":"00:55:33"}]
["Fastest Time:",null,{"$f":"C15","v":"THURLOW FISHER LAWYERS"}]
["Margins:","1st - 2nd",{"$f":"D16-D15","v":"00:00:35"}]
[null,"2nd - 3rd",{"$f":"D17-D16","v":"00:01:01"}]

{"sheet":"24-11-13","index":19,"n_rows":57,"n_cols":18,"rows_kept":57,"cut":false,"hidden":false,"merged":[[52,3,55,7],[53,0,53,1],[54,0,54,1],[49,0,49,2],[49,3,49,7],[51,3,51,7],[50,0,50,2],[50,3,50,7],[51,0,51,2],[48,0,48,2],[48,3,48,7],[12,15,12,16],[12,0,12,1],[12,4,12,6],[47,0,47,2],[47,3,47,7],[46,0,46,2],[46,3,46,7],[9,0,9,1],[0,0,0,7],[1,0,1,7],[3,0,3,1],[3,6,3,7],[7,0,7,1],[7,3,7,4],[7,5,7,7],[6,0,6,1]]}
["Australian 18 Footers League"]
["Starters and Judges Report"]
[]
["Name of Race:",null,{"$f":"Schedule!$D8","v":"3-buoy Challenge-Rnd 6"},"Entrants:",{"$f":"Schedule!G8","v":19},"Date:",{"$f":"Schedule!B8","v":"2013-11-24"}]
[null,null,{"$f":"Schedule!$E8","v":""}]
[null,null,{"$f":"Schedule!$F8","v":""},null,null,null,null,null,null,null,null,null,"Ctrl+Shift+R to formulate H/cap result."]
["Course:",null,"6/3","Wind:","12-15 ESE","Tide:","Ebbing"]
["Race Start Time:",null,"14:55:00","Race Finish Time :",null,{"$f":"D15","v":"15:56:39"}]
[]
["Start Mode:",null,{"$f":"IF(Schedule!C8=\"3b\",\"HANDICAP\",\"SCRATCH\")","v":"HANDICAP"}]
[null,"Non Starters:",1,"Non Finishers:",3]
[]
["Race Officer:",null,"Doug Cameron",null,null,null,null,null,null,null,null,null,"Entrants",null,null,"Result"]
["Finish Placings","Recall #","Boat Name","Finish Time","Elapsed Time","Handicap","Corrected Time",{"$f":"IF(C10=\"Scratch\",\"H/cap Position\",\"Scratch Position\")","v":"Scratch Position"},null,null,null,"Recall #","Boat Name","H/CAP",null,"Scratch","H/Cap"]
[1,13,{"$f":"IF(ISBLANK(B15),\"\",VLOOKUP(B15,L$15:M$45,2))","v":"RABBITOHS-KENWOOD"},"15:56:39",{"$f":"IF(ISBLANK(D15),\"\",D15-C$8)","v":"01:01:39"},{"$f":"IF(ISBLANK(B15),\"\",VLOOKUP(B15,L$15:N$45,3))","v":8},{"$f":"IF(ISBLANK(D15),\"\",IF(C$10=\"Scratch\",E15-TIME(,F15,),E15))","v":"01:01:39"},1,1,null,null,1,"THURLOW FISHER LAWYERS",0,null,4,4,4]
[2,3,"ASKO APPLIANCES","15:58:35","01:03:35",5,"01:03:35",2,2,null,null,2,"YANDOO",5,null,6,6,6]
[3,11,"MOJO WINE","15:59:38","01:04:38",1,"01:04:38",3,3,null,null,3,"ASKO APPLIANCES",5,null,2,2,2]
[4,1,"THURLOW FISHER LAWYERS","15:59:46","01:04:46",0,"01:04:46",4,4,null,null,4,"DE’LONGHI-RABBITOHS",8,null,13,13,13]
[5,10,"FISHER & PAYKEL","16:00:36","01:05:36",2,"01:05:36",5,5,null,null,5,"APPLIANCESONLINE.COM.AU",2,null,12,12,12]
[6,2,"YANDOO","16:01:26","01:06:26",5,"01:06:26",6,6,null,null,6,"COOPERS 62-RAG & FAMISH HOTEL",2,null,20,20,20]
[7,8,"SMEG","16:01:56","01:06:56",1,"01:06:56",7,7,null,null,7,"GOTTA LOVE IT 7",0,null,11,11,11]
[8,15,"HAIER APPLIANCES","16:02:25","01:07:25",3,"01:07:25",8,8,null,null,8,"SMEG",1,null,7,7,7]
[9,14,"THE KITCHEN MAKER","16:02:37","01:07:37",9,"01:07:37",9,9,null,null,9,"PURE BLONDE",7,null,20,20,20]
[10,16,"SYDNEY CITY MARINE","16:03:13","01:08:13",2,"01:08:13",10,10,null,null,10,"FISHER & PAYKEL",2,null,5,5,5]
[11,7,"GOTTA LOVE IT 7","16:05:41","01:10:41",0,"01:10:41",11,11,null,null,11,"MOJO WINE",1,null,3,3,3]
[12,5,"APPLIANCESONLINE.COM.AU","16:10:52","01:15:52",2,"01:15:52",12,12,null,null,12,"LUMIX",3,null,20,20,20]
[13,4,"DE’LONGHI-RABBITOHS","16:11:30","01:16:30",8,"01:16:30",13,13,null,null,13,"RABBITOHS-KENWOOD",8,null,1,1,1]
[14,19,"SOUTHERN CROSS","16:17:41","01:22:41",10,"01:22:41",14,14,null,null,14,"THE KITCHEN MAKER",9,null,9,9,9]
[15,17,"COMPASSFOREX.COM.AU","16:45:00","01:50:00",10,"01:50:00",15,15,null,null,15,"HAIER APPLIANCES",3,null,8,8,8]
[16,null,"",null,"","","",16,16,null,null,16,"SYDNEY CITY MARINE",2,null,10,10,10]
[17,null,"",null,"","","",17,17,null,null,17,"COMPASSFOREX.COM.AU",10,null,15,15,15]
[18,null,"",null,"","","",18,18,null,null,18,"VIAGOGO",10,null,20,20,20]
[19,null,"",null,"","","",19,19,null,null,19,"SOUTHERN CROSS",10,null,14,14,14]
[20,null,"",null,"","","",20,20,null,null,20,null,null,null,20,20,20]
[21,null,"",null,"","","",21,21,null,null,21,null,null,null,20,20,20]
[22,null,"",null,"","","",22,22,null,null,22,null,null,null,20,20,20]
[23,null,"",null,"","","",23,23,null,null,23,null,null,null,20,20,20]
[24,null,"",null,"","","",24,24,null,null,null,null,null,null,20,20,20]
[25,null,"",null,"","","",25,25,null,null,null,null,null,null,20,20]
[26,null,"",null,"","","",26,26,null,null,null,null,null,null,20,20]
[27,null,"",null,"","","",27,27,null,null,null,null,null,null,20,20]
[28,null,"",null,"","","",28,28,null,null,null,null,null,null,20,20]
[29,null,"",null,"","","",29,29,null,null,null,null,null,null,20,20]
[30,null,"",null,"","","",30,30,null,null,null,null,null,null,20,20]
[null,null,null,null,"",null,null,31,31,null,null,null,null,null,null,20,20]
[]
["Non Starters","Non Starters",null,"Non Finishers","Non Finishers"]
["Pure Blonde",null,null,"Coopers 62 Rag & Famish"]
[null,null,null,"Lumix"]
[null,null,null,"Viagogo"]
[]
[]
[null,null,"Comments:"]
["Sailing Time:",null,{"$f":"E15","v":"01:01:39"}]
["Fastest Time:",null,{"$f":"C15","v":"RABBITOHS-KENWOOD"}]
["Margins:","1st - 2nd",{"$f":"D16-D15","v":"00:01:56"}]
[null,"2nd - 3rd",{"$f":"D17-D16","v":"00:01:03"}]

{"sheet":"1-12-13","index":20,"n_rows":57,"n_cols":18,"rows_kept":57,"cut":false,"hidden":false,"merged":[[53,0,53,1],[54,0,54,1],[49,0,49,2],[49,3,49,7],[51,3,51,7],[50,0,50,2],[50,3,50,7],[51,0,51,2],[52,3,56,7],[0,0,0,7],[1,0,1,7],[3,0,3,1],[3,6,3,7],[7,0,7,1],[7,3,7,4],[7,5,7,7],[6,0,6,1],[9,0,9,1],[48,0,48,2],[48,3,48,7],[12,15,12,16],[12,0,12,1],[12,4,12,6],[47,0,47,2],[47,3,47,7],[46,3,46,7],[46,0,46,2]]}
["Australian 18 Footers League"]
["Starters and Judges Report"]
[]
["Name of Race:",null,{"$f":"Schedule!$D9","v":"3-buoy Challenge-Rnd 7"},"Entrants:",{"$f":"Schedule!G9","v":19},"Date:",{"$f":"Schedule!B9","v":"2013-12-01"}]
[null,null,{"$f":"Schedule!$E9","v":""}]
[]
["Course:",null,"6/3","Wind:","6-10 ENE","Tide:","Flooding",null,null,null,null,null,"Ctrl+Shift+R to formulate H/cap result."]
["Race Start Time:",null,"15:09:00","Race Finish Time :",null,{"$f":"D15","v":"16:14:40"}]
[]
["Start Mode:",null,{"$f":"IF(Schedule!C9=\"3b\",\"HANDICAP\",\"SCRATCH\")","v":"HANDICAP"}]
[null,"Non Starters:",0,"Non Finishers:",2,null,null,0]
[]
["Race Officer:",null,"Doug Cameron",null,null,null,null,null,null,null,null,null,"Entrants",null,null,"Result"]
["Finish Placings","Recall #","Boat Name","Finish Time","Elapsed Time","Handicap","Corrected Time",{"$f":"IF(C10=\"Scratch\",\"H/cap Position\",\"Scratch Position\")","v":"Scratch Position"},null,null,null,"Recall #","Boat Name","H/CAP",null,"Scratch","H/Cap"]
[1,6,{"$f":"IF(ISBLANK(B15),\"\",VLOOKUP(B15,L$15:M$45,2))","v":"COOPERS 62-RAG & FAMISH HOTEL"},"16:14:40",{"$f":"IF(ISBLANK(D15),\"\",D15-C$8)","v":"01:05:40"},{"$f":"IF(ISBLANK(B15),\"\",VLOOKUP(B15,L$15:N$45,3))","v":2},{"$f":"IF(ISBLANK(D15),\"\",IF(C$10=\"Scratch\",E15-TIME(,F15,),E15))","v":"01:05:40"},1,1,null,null,1,"THURLOW FISHER LAWYERS",0,null,9,9,9]
[2,11,"MOJO WINE","16:14:57","01:05:57",0,"01:05:57",2,2,null,null,2,"YANDOO",5,null,7,7,7]
[3,16,"SYDNEY CITY MARINE","16:15:13","01:06:13",2,"01:06:13",3,3,null,null,3,"ASKO APPLIANCES",3,null,4,4,4]
[4,3,"ASKO APPLIANCES","16:15:26","01:06:26",3,"01:06:26",4,4,null,null,4,"DE’LONGHI-RABBITOHS",8,null,12,12,12]
[5,13,"RABBITOHS-KENWOOD","16:15:32","01:06:32",5,"01:06:32",5,5,null,null,5,"APPLIANCESONLINE.COM.AU",2,null,6,6,6]
[6,5,"APPLIANCESONLINE.COM.AU","16:17:05","01:08:05",2,"01:08:05",6,6,null,null,6,"COOPERS 62-RAG & FAMISH HOTEL",2,null,1,1,1]
[7,2,"YANDOO","16:19:12","01:10:12",5,"01:10:12",7,7,null,null,7,"GOTTA LOVE IT 7",0,null,15,15,15]
[8,8,"SMEG","16:19:17","01:10:17",1,"01:10:17",8,8,null,null,8,"SMEG",1,null,8,8,8]
[9,1,"THURLOW FISHER LAWYERS","16:19:27","01:10:27",0,"01:10:27",9,9,null,null,9,"PURE BLONDE",7,null,20,20,20]
[10,19,"SOUTHERN CROSS","16:19:48","01:10:48",10,"01:10:48",10,10,null,null,10,"FISHER & PAYKEL",2,null,13,13,13]
[11,12,"LUMIX","16:20:42","01:11:42",3,"01:11:42",11,11,null,null,11,"MOJO WINE",0,null,2,2,2]
[12,4,"DE’LONGHI-RABBITOHS","16:21:01","01:12:01",8,"01:12:01",12,12,null,null,12,"LUMIX",3,null,11,11,11]
[13,10,"FISHER & PAYKEL","16:22:52","01:13:52",2,"01:13:52",13,13,null,null,13,"RABBITOHS-KENWOOD",5,null,5,5,5]
[14,17,"COMPASSFOREX.COM.AU","16:23:01","01:14:01",10,"01:14:01",14,14,null,null,14,"THE KITCHEN MAKER",9,null,20,20,20]
[15,7,"GOTTA LOVE IT 7","16:23:12","01:14:12",0,"01:14:12",15,15,null,null,15,"HAIER APPLIANCES",3,null,16,16,16]
[16,15,"HAIER APPLIANCES","16:25:55","01:16:55",3,"01:16:55",16,16,null,null,16,"SYDNEY CITY MARINE",2,null,3,3,3]
[17,18,"VIAGOGO","16:30:25","01:21:25",10,"01:21:25",17,17,null,null,17,"COMPASSFOREX.COM.AU",10,null,14,14,14]
[18,null,"",null,"","","",18,18,null,null,18,"VIAGOGO",10,null,17,17,17]
[19,null,"",null,"","","",19,19,null,null,19,"SOUTHERN CROSS",10,null,10,10,10]
[20,null,"",null,"","","",20,20,null,null,20,null,null,null,20,20,20]
[21,null,"",null,"","","",21,21,null,null,21,null,null,null,20,20,20]
[22,null,"",null,"","","",22,22,null,null,22,null,null,null,20,20,20]
[23,null,"",null,"","","",23,23,null,null,23,null,null,null,20,20,20]
[24,null,"",null,"","","",24,24,null,null,null,null,null,null,20,20,20]
[25,null,"",null,"","","",25,25,null,null,null,null,null,null,20,20]
[26,null,"",null,"","","",26,26,null,null,null,null,null,null,20,20]
[27,null,"",null,"","","",27,27,null,null,null,null,null,null,20,20]
[28,null,"",null,"","","",28,28,null,null,null,null,null,null,20,20]
[29,null,"",null,"","","",29,29,null,null,null,null,null,null,20,20]
[30,null,"",null,"","","",30,30,null,null,null,null,null,null,20,20]
[null,null,null,null,"",null,null,31,31,null,null,null,null,null,null,20,20]
[]
["Non Starters","Non Starters",null,"Non Finishers","Non Finishers"]
[null,null,null,"The Kitchen Maker OCS (16:19:22)"]
[null,null,null,"Pure Blonde"]
[]
[]
[]
[null,null,"Comments:"]
["Sailing Time:",null,{"$f":"E15","v":"01:05:40"}]
["Fastest Time:",null,{"$f":"C15","v":"COOPERS 62-RAG & FAMISH HOTEL"}]
["Margins:","1st - 2nd",{"$f":"D16-D15","v":"00:00:17"}]
[null,"2nd - 3rd",{"$f":"D17-D16","v":"00:00:16"}]

{"sheet":"BLANK","index":21,"n_rows":35,"n_cols":9,"rows_kept":35,"cut":false,"hidden":false,"merged":[]}
["Race Name:",null,null,null,null,"Min","Signal","Flag","Sound"]
["Date :","Course :",null,null,null,6,"Delay","AP - Up or Down ",2]
[null,null,null,null,"14:25:00",5,"Warning","Class Flag - UP",1]
["FINISH","ENTRANT","FINISH TIME",null,"14:26:00",4,"Preparatory","\"P\" - UP",1]
[1,null,"      :        :   ",null,"14:27:00",3]
[2,null,"      :        :   ",null,"14:28:00",2]
[3,null,"      :        :   ",null,"14:29:00",1,"One Minute","\"P\" - Down","1 long"]
[4,null,"      :        :   ",null,"14:30:00",0,"Start","Class Flag - Down",1]
[5,null,"      :        :   ",null,null,null,"IND Recall","Flag X",1]
[6,null,"      :        :   ",null,null,null,"GEN Recall","1st Sub",2]
[7,null,"      :        :   ",null,"14:34:00","-4","IND Recall","Flag X - Down"]
[8,null,"      :        :   "]
[9,null,"      :        :   "]
[10,null,"      :        :   "]
[11,null,"      :        :   "]
[12,null,"      :        :   "]
[13,null,"      :        :   "]
[14,null,"      :        :   "]
[15,null,"      :        :   "]
[16,null,"      :        :   "]
[17,null,"      :        :   "]
[18,null,"      :        :   "]
[19,null,"      :        :   "]
[null,null,"      :        :   "]
[null,null,"      :        :   "]
[null,null,"      :        :   "]
[null,null,"      :        :   "]
[null,null,"      :        :   "]
[null,null,"      :        :   "]
[null,null,"      :        :   "]
[null,null,"      :        :   "]
[null,null,"      :        :   "]
[null,null,"      :        :   "]
[null,null,"      :        :   "]
[31,null,"      :        :   "]

{"sheet":"Contacts","index":22,"n_rows":15,"n_cols":3,"rows_kept":15,"cut":false,"hidden":false,"merged":[]}
["18's Contacts"]
[]
["Race Team","Mobile","Email"]
["Garry Linacre","0418 224 138","garry@navionics.com.au"]
["Kelvin \"ACE\" Mowtell","0419 273 000","acemarine@bigpond.com.au"]
["Stephen McBurnie","0417 253 371","stephen@aswood-it.com"]
["Pam Scrivenor","0428 402 240","pjscriv@bigpond.com"]
["Lori Wilson","0414 898 927","lori.wilson@gmail.com"]
["Trish Hancock","0406 429 474","trishhancock@bigpond.com"]
[]
[]
[]
[]
["Club"]
["Frank Quealey","0417 421 952"," frank@18footers.com.au"]

{"sheet":"Starters","index":23,"n_rows":25,"n_cols":13,"rows_kept":25,"cut":false,"hidden":false,"merged":[]}
["Race Name:",null,null,"Buoys"]
["Date :","Course :",null,"A",null,"STARTS",null,null,1,2,3,4,5]
[null,null,null,null,null,"AP ▲",null,null,":",":",":",":",":"]
["Recall","Boat Name",null,"A",null,"AP/Recall ▼",null,null,":",":",":",":",":"]
[5,"APPLIANCESONLINE.COM.AU",null,"B",null,"Warning/Class ▲",null,null,":",":",":",":",":"]
[3,"ASKO APPLIANCES",null,"A",null,"Preparatory ▲",null,null,":",":",":",":",":"]
[17,"COMPASSFOREX.COM.AU",null,"A",null,"Prep▼ Long Sound",null,null,":",":",":",":",":"]
[6,"COOPERS 62-RAG & FAMISH HOTEL",null,"B",null,"Start/Class ▼",null,null,":",":",":",":",":"]
[4,"DE’LONGHI-RABBITOHS",null,"A"]
[18,"DONNELLY",null,"B",null,"Indiv/Gen (I/G)"]
[10,"FISHER & PAYKEL",null,"C",null,null,null,null,null,null,"Recall Numbers"]
[7,"GOTTA LOVE IT 7",null,"B"]
[15,"HAIER APPLIANCES",null,"C"]
[12,"LUMIX",null,"C"]
[11,"MOJO WINE",null,"A"]
[9,"PURE BLONDE",null,"B"]
[13,"RABBITOHS-KENWOOD",null,"C"]
[8,"SMEG",null,"B"]
[19,"SOUTHERN CROSS",null,"C"]
[16,"SYDNEY CITY MARINE",null,"C"]
[14,"THE KITCHEN MAKER",null,"C"]
[1,"THURLOW FISHER LAWYERS",null,"C"]
[2,"YANDOO",null,"B"]
[null,null,null,"C"]
[null,null,null,"B"]

{"sheet":"Entrants","index":24,"n_rows":20,"n_cols":28,"rows_kept":20,"cut":false,"hidden":false,"merged":[]}
["Recall","Boat Name","H/CAP","Buoys"]
[1,"THURLOW FISHER LAWYERS",2,"A","1   THURLOW FISHER LAWYERS",null,"MICHAEL COXON",null,null,"SCRATCH",null,null,null,null,null,{"$f":"C2+Q2","v":3},1,null,"THURLOW FISHER LAWYERS",null,null,null,null,"MICHAEL COXON"]
[2,"YANDOO",7,"A","2   YANDOO",null,null,null,null,"JOHN WINNING",null,null,"5 MINS.",null,null,{"$f":"C3+Q3","v":8},1,null,"YANDOO",null,null,null,null,null,null,null,"JOHN WINNING"]
[3,"ASKO APPLIANCES",7,"B","3   ASKO APPLIANCES",null,null,null,"MARCUS ASHLEY-JONES",null,"5 MINS.",null,null,null,null,8,1,null,"ASKO APPLIANCES",null,null,null,null,null,null,"MARCUS ASHLEY-JONES"]
[4,"DE’LONGHI-RABBITOHS",10,"A","4   DE’LONGHI-RABBITOHS",null,null,"SIMON NEARN",null,null,"8 MINS.",null,null,null,null,11,1,null,"DE’LONGHI-RABBITOHS",null,null,null,null,null,"SIMON NEARN"]
[5,"APPLIANCESONLINE.COM.AU",4,"A","5   APPLIANCESONLINE.COM.AU",null,"MICAH LANE",null,null,null,"2 MINS.",null,null,null,null,5,1,null,"APPLIANCESONLINE.COM.AU",null,null,null,null,"MICAH LANE"]
[6,"COOPERS 62-RAG & FAMISH HOTEL",0,"B","6   COOPERS 62-RAG & FAMISH HOTEL","JACK MACARTNEY",null,null,"2 MINS.",null,null,null,null,null,null,1,1,null,"RAG & FAMISH HOTEL",null,null,null,null,null,"JACK MACARTNEY"]
[7,"GOTTA LOVE IT 7",2,"A","7   GOTTA LOVE IT 7",null,null,null,"SEVE JARVIN",null,null,null,"SCRATCH",null,null,3,1,null,"GOTTA LOVE IT 7",null,null,null,null,null,null,"SEVE JARVIN"]
[8,"SMEG",3,"B","8   SMEG",null,null,null,null,"NICK PRESS",null,null,null,"1 MIN.",null,2,-1,null,"SMEG",null,null,null,null,null,null,null,null,"NICK PRESS"]
[9,"PURE BLONDE",9,"C","9   PURE BLONDE",null,null,null,"NICK DALY",null,null,null,"7 MINS.",null,null,9,0,null,"PURE BLONDE",null,null,null,null,null,null,"TOM CLOUT"]
[10,"FISHER & PAYKEL",4,"B","10 FISHER & PAYKEL",null,null,null,"GRANT ROLLERSON",null,null,"2 MINS.",null,null,null,5,1,null,"FISHER & PAYKEL",null,null,null,null,null,null,"ANDREW CHAPMAN"]
[11,"MOJO WINE",0,"C","11 MOJO WINE",null,null,null,"CHRIS NICHOLSON",null,null,"1 MIN.",null,null,null,1,1,null,"MOJO WINES",null,null,null,null,null,null,"ARCHIE MASSEY"]
[12,"LUMIX",5,"C","12  LUMIX",null,null,null,null,"JONATHAN WHITTY",null,null,"3 MINS.",null,null,6,1,null,"THE LUMIX BOAT",null,null,null,null,null,null,"JONATHAN WHITTY"]
[13,"RABBITOHS-KENWOOD",7,"A","13  RABBITOHS-KENWOOD",null,null,"BRETT VAN MUNSTER",null,null,"8 MINS.",null,null,null,null,8,1,null,"KENWOOD-RABBITOHS****",null,null,null,null,"BRETT VAN MUNSTER"]
[14,"THE KITCHEN MAKER",10,"B","14  THE KITCHEN MAKER",null,null,"MALCOLM PAGE",null,null,"9 MINS.",null,null,null,null,11,1,null,"THE KITCHEN MAKER",null,null,null,null,null,"CAMERON MC DONALD"]
[15,"HAIER APPLIANCES",5,"C","15  HAIER APPLIANCES",null,null,"RICK PEACOCK",null,null,null,"3 MINS.",null,null,null,6,1,null,"SPECTRUM TRIMMING",null,null,null,null,null,"TBA"]
[16,"SYDNEY CITY MARINE",3,"B","16  SYDNEY CITY MARINE",null,null,"DAVID WITT",null,null,null,"2 MINS.",null,null,null,4,1,null,"KENWOOD-RABBITOHS****",null,null,null,null,"ADAM BARNES"]
[17,"COMPASSFOREX.COM.AU",10,"C","17  COMPASSFOREX.COM.AU",null,null,"PEDRO VOZONE",null,null,"10 MINS.",null,null,null,null,8,-2,null,"TF COLLECT",null,null,null,null,null,null,null,"DAVE HASELDINE"]
[18,"VIAGOGO",10,null,"18  VIAGOGO",null,null,null,null,"ALEXANDRA SOUTH  ",null,null,"10 MINS."]
[19,"SOUTHERN CROSS",10,null,"19  SOUTHERN CROSS",null,null,null,"OLLIE HARTAS",null,null,null,"10 MINS."]

{"sheet":"Schedule","index":25,"n_rows":77,"n_cols":22,"rows_kept":77,"cut":false,"hidden":false,"merged":[]}
["ID","Date","Hcp","Line 1","Line 2","Line 3","Entries",null,"2013-10-13",null,"3b","3-Buoys Challenge 2012 - Race 1"]
[1,"2013-10-13","3b","3-buoy Challenge-Rnd 1 ","R. Watt Memorial Trophy"," ",19,{"$f":"CONCATENATE(\"AEG \",D2)","v":"AEG 3-buoy Challenge-Rnd 1 "},null,null,null,null,"R. Watt Memorial Trophy"]
[2,{"$f":"B2+7","v":"2013-10-20"},"3b","3-buoy Challenge-Rnd 2","Major A. Frizelle Trophy"," ",19,{"$f":"CONCATENATE(\"AEG \",D3)","v":"AEG 3-buoy Challenge-Rnd 2"}]
[3,{"$f":"B3+7","v":"2013-10-27"},"3b","3-buoy Challenge-Rnd 3 ","Chris Webb Memorial Trophy"," ",19,"AEG 3-buoy Challenge-Rnd 3 ","2013-10-20",null,"3b","3-Buoys Challenge2012 - Race 2"]
[5,"2013-11-03","3b","3-buoy Challenge-Rnd 4 ","Mick Scully Memorial Trophy"," ",19,"AEG 3-buoy Challenge-Rnd 4 ",null,null,null,null,"Major A. Frizelle Trophy"]
[6,"2013-11-10",null,"NSW Championship – Race 1","Club Championship – Race 1","W.C. ‘Trappy’ Duncan Memorial Trophy",19]
[9,"2013-11-17","3b","3-buoy Challenge-Rnd 5 ","","",19,"AEG 3-buoy Challenge-Rnd 5 ","2013-10-27",null,"3b","3-Buoys Challenge2012 - Race 3"]
[12,"2013-11-24","3b","3-buoy Challenge-Rnd 6","","",19,"AEG 3-buoy Challenge-Rnd 6",null,null,null,null,"Chris Webb Memorial Trophy"]
[14,"2013-12-01","3b","3-buoy Challenge-Rnd 7","","",19,"AEG 3-buoy Challenge-Rnd 7"]
[17,"2013-12-08","3b","3-buoy Challenge-Rnd 8","YANDOO Trophy","",19,"AEG 3-buoy Challenge-Rnd 8","2013-11-03",null,"3b","3-Buoys Challenge 2012 - Race 4"]
[19,"2013-12-15",null,"NSW Championship – Race 2","Club Championship – Race 2","Syd. Barnett Jr. Memorial Trophy",19,null,null,null,null,null,"Mick Scully Memorial Trophy"]
[23,"2014-01-12",null,"Aust. Championship – Race 1","Club Championship – Race 3","",19]
[null,{"$f":"B12+7","v":"2014-01-19"},null,"Aust. Championship – Race 2","Club Championship – Race 4","Cordukes Clubhouse Trophy",19,null,"2013-11-10",null,null,"NSW Championship - Race 1, "]
[null,{"$f":"B13+7","v":"2014-01-26"},null,"Aust. Championship – Race 3","NSW Championship – Race 3","Lord Mayor's Trophy",19,null,null,null,null,null,"Club Championship - Race 1"]
[29,"2014-02-02",null,"Aust. Championship – Race 4","Club Championship – Race 6","Commodore Cup",19,null,null,null,null,null,"W.C. ‘Trappy’ Duncan Memorial Trophy"]
[31,"2014-02-09",null,"Aust. Championship – Race 5","Club Championship – Race 7","",19]
[35,"2014-02-16",null,"NSW Championship – Race 4","Club Championship – Race 8","President’s Trophy",19,null,"2013-11-17",null,"3b","3-Buoys Challenge 2012 - Race 5"]
[39,"2014-02-23",null,"NSW Championship – Race 5","Club Championship – Race 9","",19,null,"2013-11-24",null,"3b","3-Buoys Challenge 2012 - Race 6 "]
[36,"2014-03-16","3b","Club Championship – Race 10","Ferry Patrons Trophy","",19]
[40,"2014-03-23","3b","Queen of the Harbour","","",19]
[41,"2014-03-30",null,"Club Championship – Race 11","Alice Burton Memorial Trophy"," ",19,null,"2013-12-01",null,"3b","3-Buoys Challenge 2012 - Race 7"]
[42,null,null,null," "," ",17]
[null,null,null,null," "," ",17,null,"2013-12-08",null,"3b","3-Buoys Challenge 2012 - Race 8"]
[null,null,null,null," "," ",17,null,null,null,null,null,"Yandoo Trophy"]
[]
[null,null,null,null,null,null,null,null,"2013-12-15",null,null,"NSW Championship – Race 2 "]
[null,null,null,null,null,null,null,null,null,null,null,null,"Club Championship – Race 2"]
[null,null,null,null,null,null,null,null,null,null,null,null,"Syd. Barnett Jr. Memorial Trophy"]
[null,null,null,null,null,null,null,null,"2014-01-12",12,null,null,"Australian Championship - Race 1"]
[null,null,null,null,null,null,null,null,null,null,null,null,"Club Championship - Race 3"]
[]
[null,null,null,null,null,null,null,null,"2014-01-19",null,null,null,"Australian Championship - Race 2"]
[null,null,null,null,null,null,null,null,null,null,null,null,"Club Championship - Race 4"]
[43,"2013-02-15",null,"Giltinan Championship – Invitation","Eric Bowen Memorial Trophy",null,null,null,null,null,null,null,"Cordukes Clubhouse Trophy"]
[44,{"$f":"B34+1","v":"2013-02-16"},null,"Giltinan Championship – Race 1","George Calligeros Trophy"]
[45,{"$f":"B35+1","v":"2013-02-17"},null,"Giltinan Championship – Race 2","Cliff Monkhouse Memorial Trophy",null,null,null,"2014-01-26",null,null,null,"Australian Championship - Race 3"]
[null,"2013-02-19",null,"Giltinan Championship – Race 3","Alan Cole Memorial Trophy",null,null,null,null,null,null,null,"NSW Championship - Race 3"]
[null,"2013-02-20",null,"Giltinan Championship – Race 4","A.J. Reynolds Trophy",null,null,null,null,null,null,null,"Club Championship – Race 5"]
[null,"2013-02-21",null,"Giltinan Championship – Race 5","Bill Miller Memorial Trophy",null,null,null,null,null,null,null,"Lord Mayor’s Trophy"]
[null,"2013-02-23",null,"Giltinan Championship – Race 6","‘Big Kite’ Memorial trophy"]
[null,"2013-02-24",null,"Giltinan Championship – Race 7","Alf Beashel Memorial Trophy",null,null,null,"2014-02-02",null,null,"Australian Championship - Race 4"]
[null,null,null,null,null,null,null,null,null,null,null,null,"Club Championship - Race 6"]
[null,null,null,null,null,null,null,null,null,null,null,null,"Commodore Cup"]
[]
[null,null,null,null,null,null,null,null,"2014-02-09",null,null,"Australian Championship - Race 5"]
[null,null,null,null,null,null,null,null,null,null,null,null,"Club Championship - Race 7"]
[]
[null,null,null,null,null,null,null,null,"2014-02-16",null,null,"NSW Championship - Race 4"]
[null,null,null,null,null,null,null,null,null,null,null,null,"Club Championship - Race 8"]
[null,null,null,null,null,null,null,null,null,null,null,null,"President’s Trophy"]
[]
[null,null,null,null,null,null,null,null,"2014-02-23",null,null,"NSW Championship - Race 5"]
[]
[null,null,null,null,null,null,null,null,"2014-02-28",null,null,"Giltinan Championship - Invitation Race"]
[null,null,null,null,null,null,null,null,null,null,null,null,"Eric Bowen Memorial Trophy"]
[null,null,null,null,null,null,null,null,null,1,null,null,"Giltinan Championship - Race 1"]
[null,null,null,null,null,null,null,null,null,null,null,null,"George Calligeros Trophy",null,null,null,null,null,null,null,null,"Club Championship - Race 9"]
[null,null,null,null,null,null,null,null,null,2,null,null,"Giltinan Championship - Race 2"]
[null,null,null,null,null,null,null,null,null,null,null,null,"Cliff Monkhouse Memorial Trophy"]
[null,null,null,null,null,null,null,null,null,4,null,null,"Giltinan Championship - Race 3"]
[null,null,null,null,null,null,null,null,null,null,null,null,"Alan Cole Memorial Trophy"]
[null,null,null,null,null,null,null,null,null,5,null,null,"Giltinan Championship - Race 4"]
[null,null,null,null,null,null,null,null,null,null,null,null,"A.J. Reynolds Trophy"]
[null,null,null,null,null,null,null,null,null,6,null,null,"Giltinan Championship - Race 5"]
[null,null,null,null,null,null,null,null,null,null,null,null,"Bill Miller Memorial Trophy"]
[null,null,null,null,null,null,null,null,null,8,null,null,"Giltinan Championship - Race 6"]
[null,null,null,null,null,null,null,null,null,null,"‘",null,"Big Kite’ Memorial Trophy"]
[null,null,null,null,null,null,null,null,null,9,null,null,"Giltinan Championship - Race 7"]
[null,null,null,null,null,null,null,null,null,null,null,null,"Alf Beashel Memorial Trophy"]
[]
[null,null,null,null,null,null,null,null,"2014-03-16",16,null,null,"Club Championship – Race 10"]
[null,null,null,null,null,null,null,null,"Ferry Patrons Trophy"]
[]
[null,null,null,null,null,null,null,null,"2014-03-23",23,"3b","3b","Queen of the Harbour"]
[]
[null,null,null,null,null,null,null,null,"2014-03-30",30,null,null,"Club Championship - Race 11"]
[null,null,null,null,null,null,null,null,null,null,null,null,"Alice Burton Memorial Trophy"]

{"sheet":"11-03-12","index":26,"n_rows":57,"n_cols":18,"rows_kept":57,"cut":false,"hidden":false,"merged":[[52,3,55,7],[53,0,53,1],[54,0,54,1],[49,0,49,2],[49,3,49,7],[51,3,51,7],[50,0,50,2],[50,3,50,7],[51,0,51,2],[48,0,48,2],[48,3,48,7],[12,15,12,16],[12,0,12,1],[12,4,12,6],[47,0,47,2],[47,3,47,7],[46,0,46,2],[46,3,46,7],[9,0,9,1],[0,0,0,7],[1,0,1,7],[3,0,3,1],[3,6,3,7],[7,0,7,1],[7,3,7,4],[7,5,7,7],[6,0,6,1]]}
["Australian 18 Footers League"]
["Race Officer's Report"]
[]
["Name of Race:",null,{"$f":"Schedule!$D22","v":0},"Entrants:",{"$f":"Schedule!G22","v":17},"Date:",{"$f":"Schedule!B22","v":"00:00:00"}]
[null,null,{"$f":"Schedule!$E22","v":" "}]
[null,null,{"$f":"Schedule!$F22","v":" "}]
["Course:",null,null,"Wind:",null,"Tide:"]
["Race Start Time:",null,null,"Race Finish Time :",null,{"$f":"D15","v":"00:00:00"},null,null,null,null,null,null,"Ctrl+Shift+R to formulate H/cap result."]
[]
["Start Mode:",null,{"$f":"IF(Schedule!C22=\"3b\",\"HANDICAP\",\"SCRATCH\")","v":"SCRATCH"}]
[null,"Non Starters:",0,"Non Finishers:",0,null,null,0]
[]
["Race Officer:",null,"Garry Linacre",null,null,null,null,null,null,null,null,null,"Entrants",null,null,"Result"]
["Finish Placings","Recall #","Boat Name","Finish Time","Elapsed Time","Handicap","Corrected Time",{"$f":"IF(C10=\"Scratch\",\"H/cap Position\",\"Scratch Position\")","v":"H/cap Position"},null,null,null,"Recall #","Boat Name","H/CAP",null,"Scratch","H/Cap"]
[1,null,{"$f":"IF(ISBLANK(B15),\"\",VLOOKUP(B15,L$15:M$45,2))","v":""},null,{"$f":"IF(ISBLANK(D15),\"\",D15-C$8)","v":""},{"$f":"IF(ISBLANK(B15),\"\",VLOOKUP(B15,L$15:N$45,3))","v":""},{"$f":"IF(ISBLANK(D15),\"\",IF(C$10=\"Scratch\",E15-TIME(,F15,),E15))","v":""},null,1,null,null,1,null,null,null,null,null,12]
[2,null,"",null,"","","",null,2,null,null,2,null,null,null,null,null,8]
[3,null,"",null,"","","",null,3,null,null,3,null,null,null,null,null,18]
[4,null,"",null,"","","",null,4,null,null,4,null,null,null,null,null,7]
[5,null,"",null,"","","",null,5,null,null,5,null,null,null,null,null,18]
[6,null,"",null,"","","",null,6,null,null,6,null,null,null,null,null,2]
[7,null,"",null,"","","",null,7,null,null,7,null,null,null,null,null,13]
[8,null,"",null,"","","",null,8,null,null,8,null,null,null,null,null,6]
[9,null,"",null,"","","",null,9,null,null,9,null,null,null,null,null,4]
[10,null,"",null,"","","",null,10,null,null,10,null,null,null,null,null,11]
[11,null,"",null,"","","",null,11,null,null,11,null,null,null,null,null,3]
[12,null,"",null,"","","",null,12,null,null,12,null,null,null,null,null,5]
[13,null,"",null,"","","",null,13,null,null,13,null,null,null,null,null,1]
[14,null,"",null,"","","",null,14,null,null,14,null,null,null,null,null,10]
[15,null,"",null,"","","",null,15,null,null,15,null,null,null,null,null,18]
[16,null,"",null,"","","",null,16,null,null,16,null,null,null,null,null,18]
[17,null,"",null,"","","",null,17,null,null,17,null,null,null,null,null,9]
[18,null,"",null,"","","",null,18,null,null,18,null,null,null,null,null,18]
[19,null,"",null,"","","",null,19,null,null,19,null,null,null,null,null,18]
[20,null,"",null,"","","",null,20,null,null,20,null,null,null,null,null,18]
[21,null,"",null,"","","",null,21,null,null,21,null,null,null,null,null,18]
[22,null,"",null,"","","",null,22,null,null,22,null,null,null,null,null,18]
[23,null,"",null,"","","",null,23,null,null,23,null,null,null,null,null,18]
[24,null,"",null,"","","",null,24,null,null,null,null,null,null,null,null,18]
[25,null,"",null,"","","",null,25]
[26,null,"",null,"","","",null,26]
[27,null,"",null,"","","",null,27]
[28,null,"",null,"","","",null,28]
[29,null,"",null,"","","",null,29]
[30,null,"",null,"","","",null,30]
[31,null,null,null,null,null,null,null,31]
[]
["Non Starters","Non Starters",null,"Non Finishers","Non Finishers"]
[]
[]
[]
[]
[]
[null,null,"Comments:"]
["Sailing Time:",null,{"$f":"E15","v":""}]
["Fastest Time:",null,{"$f":"C15","v":""}]
["Margins:","1st - 2nd",{"$f":"D16-D15","v":"00:00:00"}]
[null,"2nd - 3rd",{"$f":"D17-D16","v":"00:00:00"}]

{"sheet":"18-03-12","index":27,"n_rows":57,"n_cols":18,"rows_kept":57,"cut":false,"hidden":false,"merged":[[9,0,9,1],[0,0,0,7],[1,0,1,7],[3,0,3,1],[3,6,3,7],[7,0,7,1],[7,3,7,4],[7,5,7,7],[6,0,6,1],[48,0,48,2],[48,3,48,7],[12,15,12,16],[12,0,12,1],[12,4,12,6],[47,0,47,2],[47,3,47,7],[46,0,46,2],[46,3,46,7],[52,3,55,7],[53,0,53,1],[54,0,54,1],[49,0,49,2],[49,3,49,7],[51,3,51,7],[50,0,50,2],[50,3,50,7],[51,0,51,2]]}
["Australian 18 Footers League"]
["Race Officer's Report"]
[]
["Name of Race:",null,{"$f":"Schedule!$D23","v":0},"Entrants:",{"$f":"Schedule!G23","v":17},"Date:",{"$f":"Schedule!B23","v":"00:00:00"}]
[null,null,{"$f":"Schedule!$E23","v":" "}]
[null,null,{"$f":"Schedule!$F23","v":" "}]
["Course:",null,null,"Wind:",null,"Tide:"]
["Race Start Time:",null,null,"Race Finish Time :",null,{"$f":"D15","v":"00:00:00"},null,null,null,null,null,null,"Ctrl+Shift+R to formulate H/cap result."]
[]
["Start Mode:",null,{"$f":"IF(Schedule!C23=\"3b\",\"HANDICAP\",\"SCRATCH\")","v":"SCRATCH"}]
[null,"Non Starters:",0,"Non Finishers:",0,null,null,0]
[]
["Race Officer:",null,"Garry Linacre",null,null,null,null,null,null,null,null,null,"Entrants",null,null,"Result"]
["Finish Placings","Recall #","Boat Name","Finish Time","Elapsed Time","Handicap","Corrected Time",{"$f":"IF(C10=\"Scratch\",\"H/cap Position\",\"Scratch Position\")","v":"H/cap Position"},null,null,null,"Recall #","Boat Name","H/CAP",null,"Scratch","H/Cap"]
[1,null,{"$f":"IF(ISBLANK(B15),\"\",VLOOKUP(B15,L$15:M$45,2))","v":""},null,{"$f":"IF(ISBLANK(D15),\"\",D15-C$8)","v":""},{"$f":"IF(ISBLANK(B15),\"\",VLOOKUP(B15,L$15:N$45,3))","v":""},{"$f":"IF(ISBLANK(D15),\"\",IF(C$10=\"Scratch\",E15-TIME(,F15,),E15))","v":""},null,1,null,null,1,null,null,null,null,null,4]
[2,null,"",null,"","","",null,2,null,null,2,null,null,null,null,null,1]
[3,null,"",null,"","","",null,3,null,null,3,null,null,null,null,null,18]
[4,null,"",null,"","","",null,4,null,null,4,null,null,null,null,null,7]
[5,null,"",null,"","","",null,5,null,null,5,null,null,null,null,null,18]
[6,null,"",null,"","","",null,6,null,null,6,null,null,null,null,null,18]
[7,null,"",null,"","","",null,7,null,null,7,null,null,null,null,null,18]
[8,null,"",null,"","","",null,8,null,null,8,null,null,null,null,null,9]
[9,null,"",null,"","","",null,9,null,null,9,null,null,null,null,null,18]
[10,null,"",null,"","","",null,10,null,null,10,null,null,null,null,null,6]
[11,null,"",null,"","","",null,11,null,null,11,null,null,null,null,null,18]
[12,null,"",null,"","","",null,12,null,null,12,null,null,null,null,null,3]
[13,null,"",null,"","","",null,13,null,null,13,null,null,null,null,null,2]
[14,null,"",null,"","","",null,14,null,null,14,null,null,null,null,null,5]
[15,null,"",null,"","","",null,15,null,null,15,null,null,null,null,null,10]
[16,null,"",null,"","","",null,16,null,null,16,null,null,null,null,null,18]
[17,null,"",null,"","","",null,17,null,null,17,null,null,null,null,null,8]
[18,null,"",null,"","","",null,18,null,null,18,null,null,null,null,null,18]
[19,null,"",null,"","","",null,19,null,null,19,null,null,null,null,null,18]
[20,null,"",null,"","","",null,20,null,null,20,null,null,null,null,null,18]
[21,null,"",null,"","","",null,21,null,null,21,null,null,null,null,null,18]
[22,null,"",null,"","","",null,22,null,null,22,null,null,null,null,null,18]
[23,null,"",null,"","","",null,23,null,null,23,null,null,null,null,null,18]
[24,null,"",null,"","","",null,24,null,null,null,null,null,null,null,null,18]
[25,null,"",null,"","","",null,25]
[26,null,"",null,"","","",null,26]
[27,null,"",null,"","","",null,27]
[28,null,"",null,"","","",null,28]
[29,null,"",null,"","","",null,29]
[30,null,"",null,"","","",null,30]
[31,null,null,null,null,null,null,null,31]
[]
["Non Starters","Non Starters",null,"Non Finishers","Non Finishers"]
[]
[]
[]
[]
[]
[null,null,"Comments:"]
["Sailing Time:",null,{"$f":"E15","v":""}]
["Fastest Time:",null,{"$f":"C15","v":""}]
["Margins:","1st - 2nd",{"$f":"D16-D15","v":"00:00:00"}]
[null,"2nd - 3rd",{"$f":"D17-D16","v":"00:00:00"}]

{"sheet":"25-03-12","index":28,"n_rows":57,"n_cols":18,"rows_kept":57,"cut":false,"hidden":false,"merged":[[52,3,55,7],[53,0,53,1],[54,0,54,1],[49,0,49,2],[49,3,49,7],[51,3,51,7],[50,0,50,2],[50,3,50,7],[51,0,51,2],[48,0,48,2],[48,3,48,7],[12,15,12,16],[12,0,12,1],[12,4,12,6],[47,0,47,2],[47,3,47,7],[46,0,46,2],[46,3,46,7],[9,0,9,1],[0,0,0,7],[1,0,1,7],[3,0,3,1],[3,6,3,7],[7,0,7,1],[7,3,7,4],[7,5,7,7],[6,0,6,1]]}
["Australian 18 Footers League"]
["Race Officer's Report"]
[]
["Name of Race:",null,{"$f":"Schedule!$D24","v":0},"Entrants:",{"$f":"Schedule!G24","v":17},"Date:",{"$f":"Schedule!B24","v":"00:00:00"}]
[null,null,{"$f":"Schedule!$E24","v":" "}]
[null,null,{"$f":"Schedule!$F2","v":" "}]
["Course:",null,null,"Wind:",null,"Tide:"]
["Race Start Time:",null,null,"Race Finish Time :",null,{"$f":"D15","v":"00:00:00"},null,null,null,null,null,null,"Ctrl+Shift+R to formulate H/cap result."]
[]
["Start Mode:",null,{"$f":"IF(Schedule!C24=\"3b\",\"HANDICAP\",\"SCRATCH\")","v":"SCRATCH"}]
[null,"Non Starters:",0,"Non Finishers:",0,null,null,0]
[]
["Race Officer:",null,"Garry Linacre",null,null,null,null,null,null,null,null,null,"Entrants",null,null,"Result"]
["Finish Placings","Recall #","Boat Name","Finish Time","Elapsed Time","Handicap","Corrected Time",{"$f":"IF(C10=\"Scratch\",\"H/cap Position\",\"Scratch Position\")","v":"H/cap Position"},null,null,null,"Recall #","Boat Name","H/CAP",null,"Scratch","H/Cap"]
[1,null,{"$f":"IF(ISBLANK(B15),\"\",VLOOKUP(B15,L$15:M$45,2))","v":""},null,{"$f":"IF(ISBLANK(D15),\"\",D15-C$8)","v":""},{"$f":"IF(ISBLANK(B15),\"\",VLOOKUP(B15,L$15:N$45,3))","v":""},{"$f":"IF(ISBLANK(D15),\"\",IF(C$10=\"Scratch\",E15-TIME(,F15,),E15))","v":""},null,1,null,null,1,null,null,null,null,null,4]
[2,null,"",null,"","","",null,2,null,null,2,null,null,null,null,null,5]
[3,null,"",null,"","","",null,3,null,null,3,null,null,null,null,null,18]
[4,null,"",null,"","","",null,4,null,null,4,null,null,null,null,null,6]
[5,null,"",null,"","","",null,5,null,null,5,null,null,null,null,null,3]
[6,null,"",null,"","","",null,6,null,null,6,null,null,null,null,null,1]
[7,null,"",null,"","","",null,7,null,null,7,null,null,null,null,null,2]
[8,null,"",null,"","","",null,8,null,null,8,null,null,null,null,null,8]
[9,null,"",null,"","","",null,9,null,null,9,null,null,null,null,null,13]
[10,null,"",null,"","","",null,10,null,null,10,null,null,null,null,null,11]
[11,null,"",null,"","","",null,11,null,null,11,null,null,null,null,null,18]
[12,null,"",null,"","","",null,12,null,null,12,null,null,null,null,null,12]
[13,null,"",null,"","","",null,13,null,null,13,null,null,null,null,null,10]
[14,null,"",null,"","","",null,14,null,null,14,null,null,null,null,null,9]
[15,null,"",null,"","","",null,15,null,null,15,null,null,null,null,null,7]
[16,null,"",null,"","","",null,16,null,null,16,null,null,null,null,null,18]
[17,null,"",null,"","","",null,17,null,null,17,null,null,null,null,null,14]
[18,null,"",null,"","","",null,18,null,null,18,null,null,null,null,null,18]
[19,null,"",null,"","","",null,19,null,null,19,null,null,null,null,null,18]
[20,null,"",null,"","","",null,20,null,null,20,null,null,null,null,null,18]
[21,null,"",null,"","","",null,21,null,null,21,null,null,null,null,null,18]
[22,null,"",null,"","","",null,22,null,null,22,null,null,null,null,null,18]
[23,null,"",null,"","","",null,23,null,null,23,null,null,null,null,null,18]
[24,null,"",null,"","","",null,24,null,null,null,null,null,null,null,null,18]
[25,null,"",null,"","","",null,25]
[26,null,"",null,"","","",null,26]
[27,null,"",null,"","","",null,27]
[28,null,"",null,"","","",null,28]
[29,null,"",null,"","","",null,29]
[30,null,"",null,"","","",null,30]
[31,null,null,null,null,null,null,null,31]
[]
["Non Starters","Non Starters",null,"Non Finishers","Non Finishers"]
[]
[]
[]
[]
[]
[null,null,"Comments:"]
["Sailing Time:",null,{"$f":"E15","v":""}]
["Fastest Time:",null,{"$f":"C15","v":""}]
["Margins:","1st - 2nd",{"$f":"D16-D15","v":"00:00:00"}]
[null,"2nd - 3rd",{"$f":"D17-D16","v":"00:00:00"}]

{"sheet":"2011-12","index":29,"n_rows":33,"n_cols":4,"rows_kept":33,"cut":false,"hidden":false,"merged":[]}
["2011-10-09","3b","R. Watt Memorial Trophy"]
["2011-10-16","3b","3-buoys Challenge – Round 1 ","Major A. Frizelle Trophy"]
["2011-10-23","3b","3-buoys Challenge – Round 2","Chris Webb Memorial Trophy"]
["2011-10-30","3b","3-buoys Challenge – Round 3 ","Mick Scully Memorial Trophy"]
["2011-11-06","3b","3-buoys Challenge – Round 4 ","W.C. ‘Trappy’ Duncan Memorial Trophy"]
["2011-11-13","3b","3-buoys Challenge – Round 5 ","(Winning Appliances Trophy)"]
["2011-11-20",null,"NSW Championship – Race 1","Club Championship – Race 1"]
["2011-11-27",null,"NSW Championship – Race 2","Club Championship – Race 2"]
["2011-12-04",null,"NSW Championship – Race 3","Club Championship – Race 3"]
["2011-12-11",null,"NSW Championship – Race 4","Club Championship – Race 4"]
["2011-12-18",null,"NSW Championship – Race 5","Club Championship – Race 5"]
["2011-12-25",null,"No Race","No Race"]
["2012-01-01",null,"No Race"]
["2012-01-08","3b","Cordukes Clubhouse Trophy"]
["2012-01-15",null,"Australian Championship – Race 1","Club Championship – Race 6"]
["2012-01-22",null,"Australian Championship – Race 2","Club Championship – Race 7"]
["2011-01-26",null,"Australian Championship – Race 3","Club Championship – Race 8"]
["2011-01-29",null,"Australian Championship – Race 4","Club Championship – Race 9"]
["2011-02-05",null,"Australian Championship – Race 5","Club Championship – Race 10"]
["2011-02-10","3b","Commodore Cup (Twilight Race)"]
["2011-02-12","3b","President’s Trophy"]
["2011-02-17",null,"Giltinan Championship – Invitation","Eric Bowen Memorial Trophy"]
["2011-02-18",null,"Giltinan Championship – Race 1","George Calligeros Trophy"]
["2011-02-19",null,"Giltinan Championship – Race 2","Cliff Monkhouse Memorial Trophy"]
["2011-02-21",null,"Giltinan Championship – Race 3","Alan Cole Memorial Trophy"]
["2011-02-22",null,"Giltinan Championship – Race 4","A.J. Reynolds Trophy"]
["2011-02-23",null,"Giltinan Championship – Race 5","Bill Miller Memorial Trophy"]
["2011-02-25",null,"Giltinan Championship – Race 6","‘Big Kite’ Memorial trophy"]
["2011-02-26",null,"Giltinan Championship – Race 7","Alf Beashel Memorial Trophy"]
["2011-03-04","3b","Ferry Patrons Trophy"]
["2011-03-11","3b","Queen of the Harbour"]
["2011-03-18","3b","Alice Burton Memorial Trophy"]
["2011-03-25",null,"Club Championship – Race 11"]

{"sheet":"Point Score OLD","index":30,"n_rows":148,"n_cols":37,"rows_kept":148,"cut":false,"hidden":false,"merged":[]}
["AUSTRALIAN 18Ft League - 2011/12 Club Championship Point Score",null,null,null,null,null,null,null,null,null,null,null,null,null,null,null,null,null,null,null,null,null,null,null,null,null,null,null,null,null,null,"Ctrl+R to Sort by Recall"]
[null,null,{"$f":"'24-11-13'!G4","v":"2013-11-24"},{"$f":"'1-12-13'!G4","v":"2013-12-01"},{"$f":"'8-12-13'!G4","v":"2013-12-08"},{"$f":"'15-12-13'!G4","v":"2013-12-15"},{"$f":"'12-01-14'!G4","v":"2014-01-12"},{"$f":"'26-01-14'!G4","v":"2014-01-26"},{"$f":"'2-02-14'!G4","v":"2014-02-02"},{"$f":"'9-02-14'!G4","v":"2014-02-09"},{"$f":"'16-02-14'!G4","v":"2014-02-16"},{"$f":"'23-02-14'!G4","v":"2014-03-16"},{"$f":"'25-03-12'!G4","v":"00:00:00"},null,null,null,null,null,null,null,null,null,null,null,null,null,null,null,null,null,null,"Ctrl+S to Sort by Points"]
["Recall","Name","R1","R2","R3","R4","R5","R6","R7","R8","R9","R10","R11",null,null,null,null,"Total","POS",null,null,null,null,null,null,null,null,null,null,null,null,"R3"]
[1,"THURLOW FISHER LAWYERS",{"$f":"'24-11-13'!$P15","v":4},{"$f":"'1-12-13'!$P15","v":9},{"$f":"'8-12-13'!$P15","v":0},{"$f":"'15-12-13'!$P15","v":0},{"$f":"'12-01-14'!$P15","v":0},{"$f":"'26-01-14'!$P15","v":0},{"$f":"'2-02-14'!$P15","v":0},{"$f":"'9-02-14'!$P15","v":0},{"$f":"'16-02-14'!$P15","v":0},{"$f":"'23-02-14'!$P15","v":0},{"$f":"'25-03-12'!$P15","v":0},null,null,null,null,{"$f":"SUM(C4:Q4)","v":13},1]
[2,"YANDOO",{"$f":"'24-11-13'!$P16","v":6},{"$f":"'1-12-13'!$P16","v":7},{"$f":"'8-12-13'!$P16","v":0},{"$f":"'15-12-13'!$P16","v":0},{"$f":"'12-01-14'!$P16","v":0},{"$f":"'26-01-14'!$P16","v":0},{"$f":"'2-02-14'!$P16","v":0},{"$f":"'9-02-14'!$P16","v":0},{"$f":"'16-02-14'!$P16","v":0},{"$f":"'23-02-14'!$P16","v":0},{"$f":"'25-03-12'!$P16","v":0},null,null,null,null,13,2]
[3,"ASKO APPLIANCES",{"$f":"'24-11-13'!$P17","v":2},{"$f":"'1-12-13'!$P17","v":4},{"$f":"'8-12-13'!$P17","v":0},{"$f":"'15-12-13'!$P17","v":0},{"$f":"'12-01-14'!$P17","v":0},{"$f":"'26-01-14'!$P17","v":0},{"$f":"'2-02-14'!$P17","v":0},{"$f":"'9-02-14'!$P17","v":0},{"$f":"'16-02-14'!$P17","v":0},{"$f":"'23-02-14'!$P17","v":0},{"$f":"'25-03-12'!$P17","v":0},null,null,null,null,6,3]
[4,"DE'LONGHI-RABBITOHS",{"$f":"'24-11-13'!$P18","v":13},{"$f":"'1-12-13'!$P18","v":12},{"$f":"'8-12-13'!$P18","v":0},{"$f":"'15-12-13'!$P18","v":0},{"$f":"'12-01-14'!$P18","v":0},{"$f":"'26-01-14'!$P18","v":0},{"$f":"'2-02-14'!$P18","v":0},{"$f":"'9-02-14'!$P18","v":0},{"$f":"'16-02-14'!$P18","v":0},{"$f":"'23-02-14'!$P18","v":0},{"$f":"'25-03-12'!$P18","v":0},null,null,null,null,25,4]
[5,"APPLIANCESONLINE.COM.AU",{"$f":"'24-11-13'!$P19","v":12},{"$f":"'1-12-13'!$P19","v":6},{"$f":"'8-12-13'!$P19","v":0},{"$f":"'15-12-13'!$P19","v":0},{"$f":"'12-01-14'!$P19","v":0},{"$f":"'26-01-14'!$P19","v":0},{"$f":"'2-02-14'!$P19","v":0},{"$f":"'9-02-14'!$P19","v":0},{"$f":"'16-02-14'!$P19","v":0},{"$f":"'23-02-14'!$P19","v":0},{"$f":"'25-03-12'!$P19","v":0},null,null,null,null,18,5]
[6,"RAG & FAMISH HOTEL",{"$f":"'24-11-13'!$P20","v":20},{"$f":"'1-12-13'!$P20","v":1},{"$f":"'8-12-13'!$P20","v":0},{"$f":"'15-12-13'!$P20","v":0},{"$f":"'12-01-14'!$P20","v":0},{"$f":"'26-01-14'!$P20","v":0},{"$f":"'2-02-14'!$P20","v":0},{"$f":"'9-02-14'!$P20","v":0},{"$f":"'16-02-14'!$P20","v":0},{"$f":"'23-02-14'!$P20","v":0},{"$f":"'25-03-12'!$P20","v":0},null,null,null,null,21,6]
[7,"GOTTA LOVE IT 7",{"$f":"'24-11-13'!$P21","v":11},{"$f":"'1-12-13'!$P21","v":15},{"$f":"'8-12-13'!$P21","v":0},{"$f":"'15-12-13'!$P21","v":0},{"$f":"'12-01-14'!$P21","v":0},{"$f":"'26-01-14'!$P21","v":0},{"$f":"'2-02-14'!$P21","v":0},{"$f":"'9-02-14'!$P21","v":0},{"$f":"'16-02-14'!$P21","v":0},{"$f":"'23-02-14'!$P21","v":0},{"$f":"'25-03-12'!$P21","v":0},null,null,null,null,26,7]
[8,"SMEG",{"$f":"'24-11-13'!$P22","v":7},{"$f":"'1-12-13'!$P22","v":8},{"$f":"'8-12-13'!$P22","v":0},{"$f":"'15-12-13'!$P22","v":0},{"$f":"'12-01-14'!$P22","v":0},{"$f":"'26-01-14'!$P22","v":0},{"$f":"'2-02-14'!$P22","v":0},{"$f":"'9-02-14'!$P22","v":0},{"$f":"'16-02-14'!$P22","v":0},{"$f":"'23-02-14'!$P22","v":0},{"$f":"'25-03-12'!$P22","v":0},null,null,null,null,15,8]
[9,"PURE BLONDE",{"$f":"'24-11-13'!$P23","v":20},{"$f":"'1-12-13'!$P23","v":20},{"$f":"'8-12-13'!$P23","v":0},{"$f":"'15-12-13'!$P23","v":0},{"$f":"'12-01-14'!$P23","v":0},{"$f":"'26-01-14'!$P23","v":0},{"$f":"'2-02-14'!$P23","v":0},{"$f":"'9-02-14'!$P23","v":0},{"$f":"'16-02-14'!$P23","v":0},{"$f":"'23-02-14'!$P23","v":0},{"$f":"'25-03-12'!$P23","v":0},null,null,null,null,40,9]
[10,"FISHER & PAYKEL",{"$f":"'24-11-13'!$P24","v":5},{"$f":"'1-12-13'!$P24","v":13},{"$f":"'8-12-13'!$P24","v":0},{"$f":"'15-12-13'!$P24","v":0},{"$f":"'12-01-14'!$P24","v":0},{"$f":"'26-01-14'!$P24","v":0},{"$f":"'2-02-14'!$P24","v":0},{"$f":"'9-02-14'!$P24","v":0},{"$f":"'16-02-14'!$P24","v":0},{"$f":"'23-02-14'!$P24","v":0},{"$f":"'25-03-12'!$P24","v":0},null,null,null,null,18,10]
[11,"RED CLAW",{"$f":"'24-11-13'!$P25","v":3},{"$f":"'1-12-13'!$P25","v":2},{"$f":"'8-12-13'!$P25","v":0},{"$f":"'15-12-13'!$P25","v":0},{"$f":"'12-01-14'!$P25","v":0},{"$f":"'26-01-14'!$P25","v":0},{"$f":"'2-02-14'!$P25","v":0},{"$f":"'9-02-14'!$P25","v":0},{"$f":"'16-02-14'!$P25","v":0},{"$f":"'23-02-14'!$P25","v":0},{"$f":"'25-03-12'!$P25","v":0},null,null,null,null,5,11]
[12,"PANASONIC",{"$f":"'24-11-13'!$P26","v":20},{"$f":"'1-12-13'!$P26","v":11},{"$f":"'8-12-13'!$P26","v":0},{"$f":"'15-12-13'!$P26","v":0},{"$f":"'12-01-14'!$P26","v":0},{"$f":"'26-01-14'!$P26","v":0},{"$f":"'2-02-14'!$P26","v":0},{"$f":"'9-02-14'!$P26","v":0},{"$f":"'16-02-14'!$P26","v":0},{"$f":"'23-02-14'!$P26","v":0},{"$f":"'25-03-12'!$P26","v":0},null,null,null,null,31,12]
[13,"KENWOOD-RABBITOHS",{"$f":"'24-11-13'!$P27","v":1},{"$f":"'1-12-13'!$P27","v":5},{"$f":"'8-12-13'!$P27","v":0},{"$f":"'15-12-13'!$P27","v":0},{"$f":"'12-01-14'!$P27","v":0},{"$f":"'26-01-14'!$P27","v":0},{"$f":"'2-02-14'!$P27","v":0},{"$f":"'9-02-14'!$P27","v":0},{"$f":"'16-02-14'!$P27","v":0},{"$f":"'23-02-14'!$P27","v":0},{"$f":"'25-03-12'!$P27","v":0},null,null,null,null,6,13]
[14,"TF COLLECT",{"$f":"'24-11-13'!$P28","v":9},{"$f":"'1-12-13'!$P28","v":20},{"$f":"'8-12-13'!$P28","v":0},{"$f":"'15-12-13'!$P28","v":0},{"$f":"'12-01-14'!$P28","v":0},{"$f":"'26-01-14'!$P28","v":0},{"$f":"'2-02-14'!$P28","v":0},{"$f":"'9-02-14'!$P28","v":0},{"$f":"'16-02-14'!$P28","v":0},{"$f":"'23-02-14'!$P28","v":0},{"$f":"'25-03-12'!$P28","v":0},null,null,null,null,29,14]
[15,"THE KITCHEN MAKER",{"$f":"'24-11-13'!$P29","v":8},{"$f":"'1-12-13'!$P29","v":16},{"$f":"'8-12-13'!$P29","v":0},{"$f":"'15-12-13'!$P29","v":0},{"$f":"'12-01-14'!$P29","v":0},{"$f":"'26-01-14'!$P29","v":0},{"$f":"'2-02-14'!$P29","v":0},{"$f":"'9-02-14'!$P29","v":0},{"$f":"'16-02-14'!$P29","v":0},{"$f":"'23-02-14'!$P29","v":0},{"$f":"'25-03-12'!$P29","v":0},null,null,null,null,24,15]
[16,"PROJECT RACING",{"$f":"'24-11-13'!$P30","v":10},{"$f":"'1-12-13'!$P30","v":3},{"$f":"'8-12-13'!$P30","v":0},{"$f":"'15-12-13'!$P30","v":0},{"$f":"'12-01-14'!$P30","v":0},{"$f":"'26-01-14'!$P30","v":0},{"$f":"'2-02-14'!$P30","v":0},{"$f":"'9-02-14'!$P30","v":0},{"$f":"'16-02-14'!$P30","v":0},{"$f":"'23-02-14'!$P30","v":0},{"$f":"'25-03-12'!$P30","v":0},null,null,null,null,13,16]
[17,"TEAM PARKINSON",{"$f":"'24-11-13'!$P31","v":15},{"$f":"'1-12-13'!$P31","v":14},{"$f":"'8-12-13'!$P31","v":0},{"$f":"'15-12-13'!$P31","v":0},{"$f":"'12-01-14'!$P31","v":0},{"$f":"'26-01-14'!$P31","v":0},{"$f":"'2-02-14'!$P31","v":0},{"$f":"'9-02-14'!$P31","v":0},{"$f":"'16-02-14'!$P31","v":0},{"$f":"'23-02-14'!$P31","v":0},{"$f":"'25-03-12'!$P31","v":0},null,null,null,null,29,17]
[18,null,{"$f":"'3-11-13'!$P32","v":0},{"$f":"'10-11-13'!$P32","v":20},{"$f":"'17-11-13'!$P32","v":20},{"$f":"'24-11-13'!$P32","v":20},{"$f":"'1-12-13'!$P32","v":17},{"$f":"'8-12-13'!$P32","v":0},{"$f":"'12-01-14'!$P32","v":0},{"$f":"'19-01-14'!$P32","v":0},{"$f":"'26-01-14'!$P32","v":0},{"$f":"'2-02-14'!$P32","v":0},{"$f":"'9-02-14'!$P32","v":0},{"$f":"'23-02-14'!$P32","v":0},{"$f":"'16-03-14'!$P32","v":0},{"$f":"'30-03-14'!$P32","v":0},null,null,{"$f":"S20+1","v":18}]
[19,null,{"$f":"'3-11-13'!$P33","v":0},{"$f":"'10-11-13'!$P33","v":20},{"$f":"'17-11-13'!$P33","v":14},{"$f":"'24-11-13'!$P33","v":14},{"$f":"'1-12-13'!$P33","v":10},{"$f":"'8-12-13'!$P33","v":0},{"$f":"'12-01-14'!$P33","v":0},{"$f":"'19-01-14'!$P33","v":0},{"$f":"'26-01-14'!$P33","v":0},{"$f":"'2-02-14'!$P33","v":0},{"$f":"'9-02-14'!$P33","v":0},{"$f":"'23-02-14'!$P33","v":0},{"$f":"'16-03-14'!$P33","v":0},{"$f":"'30-03-14'!$P33","v":0},null,null,19]
[20,null,{"$f":"'3-11-13'!$P34","v":0},{"$f":"'10-11-13'!$P34","v":20},{"$f":"'17-11-13'!$P34","v":20},{"$f":"'24-11-13'!$P34","v":20},{"$f":"'1-12-13'!$P34","v":20},{"$f":"'8-12-13'!$P34","v":0},{"$f":"'12-01-14'!$P34","v":0},{"$f":"'19-01-14'!$P34","v":0},{"$f":"'26-01-14'!$P34","v":0},{"$f":"'2-02-14'!$P34","v":0},{"$f":"'9-02-14'!$P34","v":0},{"$f":"'23-02-14'!$P34","v":0},{"$f":"'16-03-14'!$P34","v":0},{"$f":"'30-03-14'!$P34","v":0},null,null,20]
[21,null,{"$f":"'3-11-13'!$P35","v":0},{"$f":"'10-11-13'!$P35","v":20},{"$f":"'17-11-13'!$P35","v":20},{"$f":"'24-11-13'!$P35","v":20},{"$f":"'1-12-13'!$P35","v":20},{"$f":"'8-12-13'!$P35","v":0},{"$f":"'12-01-14'!$P35","v":0},{"$f":"'19-01-14'!$P35","v":0},{"$f":"'26-01-14'!$P35","v":0},{"$f":"'2-02-14'!$P35","v":0},{"$f":"'9-02-14'!$P35","v":0},{"$f":"'23-02-14'!$P35","v":0},{"$f":"'16-03-14'!$P35","v":0},{"$f":"'30-03-14'!$P35","v":0},{"$f":"'18-03-12'!$P35","v":0},null,21]
[22,null,{"$f":"'3-11-13'!$P36","v":0},{"$f":"'10-11-13'!$P36","v":20},{"$f":"'17-11-13'!$P36","v":20},{"$f":"'24-11-13'!$P36","v":20},{"$f":"'1-12-13'!$P36","v":20},{"$f":"'8-12-13'!$P36","v":0},{"$f":"'12-01-14'!$P36","v":0},{"$f":"'19-01-14'!$P36","v":0},{"$f":"'26-01-14'!$P36","v":0},{"$f":"'2-02-14'!$P36","v":0},{"$f":"'9-02-14'!$P36","v":0},{"$f":"'23-02-14'!$P36","v":0},{"$f":"'16-03-14'!$P36","v":0},{"$f":"'30-03-14'!$P36","v":0},{"$f":"'18-03-12'!$P36","v":0},null,22]
[23,null,{"$f":"'3-11-13'!$P37","v":0},{"$f":"'10-11-13'!$P37","v":20},{"$f":"'17-11-13'!$P37","v":20},{"$f":"'24-11-13'!$P37","v":20},{"$f":"'1-12-13'!$P37","v":20},{"$f":"'8-12-13'!$P37","v":0},{"$f":"'12-01-14'!$P37","v":0},{"$f":"'19-01-14'!$P37","v":0},{"$f":"'26-01-14'!$P37","v":0},{"$f":"'2-02-14'!$P37","v":0},{"$f":"'9-02-14'!$P37","v":0},{"$f":"'23-02-14'!$P37","v":0},{"$f":"'16-03-14'!$P37","v":0},{"$f":"'30-03-14'!$P37","v":0},{"$f":"'18-03-12'!$P37","v":0},null,23]
[]
[]
["Notes:"]
[]
[]
["AUSTRALIAN 18Ft League - 2011/12 Season Handicap Point Score"]
[null,null,{"$f":"'13-10-13'!G4","v":"2013-10-13"},{"$f":"'20-10-13'!G4","v":"2013-10-20"},{"$f":"'27-10-13'!$G4","v":"2013-10-27"},{"$f":"'3-11-13'!$G4","v":"2013-11-03"},{"$f":"'10-11-13'!$G4","v":"2013-11-10"},{"$f":"'17-11-13'!$G4","v":"2013-11-17"},{"$f":"'24-11-13'!$G4","v":"2013-11-24"},{"$f":"'1-12-13'!$G4","v":"2013-12-01"},{"$f":"'8-12-13'!$G4","v":"2013-12-08"},{"$f":"'15-12-13'!$G4","v":"2013-12-15"},{"$f":"'12-01-14'!$G4","v":"2014-01-12"},{"$f":"'19-01-14'!$G4","v":"2014-01-19"},{"$f":"'26-01-14'!$G4","v":"2014-01-26"},{"$f":"'2-02-14'!$G4","v":"2014-02-02"},{"$f":"'9-02-14'!$G4","v":"2014-02-09"},{"$f":"'16-02-14'!$G4","v":"2014-02-16"},{"$f":"'23-02-14'!$G4","v":"2014-03-16"},{"$f":"'16-03-14'!$G4","v":"2014-02-23"},{"$f":"'23-03-14'!$G4","v":"2014-03-23"},{"$f":"'30-03-14'!$G4","v":"2014-03-30"},{"$f":"'11-03-12'!$G4","v":"00:00:00"},{"$f":"'18-03-12'!$G4","v":"00:00:00"},{"$f":"'25-03-12'!$G4","v":"00:00:00"}]
["Recall","Name","R1","R2","R3","R4","R5","R6","R7","R8","R9","R10","R11","R12","R13","R14","R15","R16","R17","T1","R19","R20","R21","R22","R23","Total","POS"]
[1,"THURLOW FISHER LAWYERS",{"$f":"'13-10-13'!Q15","v":20},{"$f":"'20-10-13'!Q15","v":7},{"$f":"'27-10-13'!$Q15","v":4},{"$f":"'3-11-13'!$Q15","v":0},{"$f":"'10-11-13'!$Q15","v":4},{"$f":"'17-11-13'!$Q15","v":1},{"$f":"'24-11-13'!$Q15","v":4},{"$f":"'1-12-13'!$Q15","v":9},{"$f":"'8-12-13'!$Q15","v":0},{"$f":"'15-12-13'!$Q15","v":0},{"$f":"'12-01-14'!$Q15","v":0},{"$f":"'19-01-14'!$Q15","v":0},{"$f":"'26-01-14'!$Q15","v":0},{"$f":"'2-02-14'!$Q15","v":0},{"$f":"'9-02-14'!$Q15","v":0},{"$f":"'16-02-14'!$Q15","v":0},{"$f":"'23-02-14'!$Q15","v":0},{"$f":"'16-03-14'!$Q15","v":0},{"$f":"'23-03-14'!$Q15","v":0},{"$f":"'30-03-14'!$Q15","v":0},{"$f":"'11-03-12'!$Q15","v":0},{"$f":"'18-03-12'!$Q15","v":0},{"$f":"'25-03-12'!$Q33","v":0},{"$f":"SUM(C35:Y35)","v":49},1]
[2,"YANDOO",{"$f":"'13-10-13'!Q16","v":20},{"$f":"'20-10-13'!Q16","v":2},{"$f":"'27-10-13'!$Q16","v":6},{"$f":"'3-11-13'!$Q16","v":0},{"$f":"'10-11-13'!$Q16","v":13},{"$f":"'17-11-13'!$Q16","v":5},{"$f":"'24-11-13'!$Q16","v":6},{"$f":"'1-12-13'!$Q16","v":7},{"$f":"'8-12-13'!$Q16","v":0},{"$f":"'15-12-13'!$Q16","v":0},{"$f":"'12-01-14'!$Q16","v":0},{"$f":"'19-01-14'!$Q16","v":0},{"$f":"'26-01-14'!$Q16","v":0},{"$f":"'2-02-14'!$Q16","v":0},{"$f":"'9-02-14'!$Q16","v":0},{"$f":"'16-02-14'!$Q16","v":0},{"$f":"'23-02-14'!$Q16","v":0},{"$f":"'16-03-14'!$Q16","v":0},{"$f":"'23-03-14'!$Q16","v":0},{"$f":"'30-03-14'!$Q16","v":0},{"$f":"'11-03-12'!$Q16","v":0},{"$f":"'18-03-12'!$Q16","v":0},{"$f":"'25-03-12'!$Q34","v":0},59,2]
[3,"ASKO APPLIANCES",{"$f":"'13-10-13'!Q17","v":20},{"$f":"'20-10-13'!Q17","v":4},{"$f":"'27-10-13'!$Q17","v":20},{"$f":"'3-11-13'!$Q17","v":0},{"$f":"'10-11-13'!$Q17","v":12},{"$f":"'17-11-13'!$Q17","v":11},{"$f":"'24-11-13'!$Q17","v":2},{"$f":"'1-12-13'!$Q17","v":4},{"$f":"'8-12-13'!$Q17","v":0},{"$f":"'15-12-13'!$Q17","v":0},{"$f":"'12-01-14'!$Q17","v":0},{"$f":"'19-01-14'!$Q17","v":0},{"$f":"'26-01-14'!$Q17","v":0},{"$f":"'2-02-14'!$Q17","v":0},{"$f":"'9-02-14'!$Q17","v":0},{"$f":"'16-02-14'!$Q17","v":0},{"$f":"'23-02-14'!$Q17","v":0},{"$f":"'16-03-14'!$Q17","v":0},{"$f":"'23-03-14'!$Q17","v":0},{"$f":"'30-03-14'!$Q17","v":0},{"$f":"'11-03-12'!$Q17","v":0},{"$f":"'18-03-12'!$Q17","v":0},{"$f":"'25-03-12'!$Q35","v":0},73,3]
[4,"DE'LONGHI-RABBITOHS",{"$f":"'13-10-13'!Q18","v":20},{"$f":"'20-10-13'!Q18","v":5},{"$f":"'27-10-13'!$Q18","v":9},{"$f":"'3-11-13'!$Q18","v":0},{"$f":"'10-11-13'!$Q18","v":8},{"$f":"'17-11-13'!$Q18","v":10},{"$f":"'24-11-13'!$Q18","v":13},{"$f":"'1-12-13'!$Q18","v":12},{"$f":"'8-12-13'!$Q18","v":0},{"$f":"'15-12-13'!$Q18","v":0},{"$f":"'12-01-14'!$Q18","v":0},{"$f":"'19-01-14'!$Q18","v":0},{"$f":"'26-01-14'!$Q18","v":0},{"$f":"'2-02-14'!$Q18","v":0},{"$f":"'9-02-14'!$Q18","v":0},{"$f":"'16-02-14'!$Q18","v":0},{"$f":"'23-02-14'!$Q18","v":0},{"$f":"'16-03-14'!$Q18","v":0},{"$f":"'23-03-14'!$Q18","v":0},{"$f":"'30-03-14'!$Q18","v":0},{"$f":"'11-03-12'!$Q18","v":0},{"$f":"'18-03-12'!$Q18","v":0},{"$f":"'25-03-12'!$Q36","v":0},77,4]
[5,"APPLIANCESONLINE.COM.AU",{"$f":"'13-10-13'!Q19","v":20},{"$f":"'20-10-13'!Q19","v":20},{"$f":"'27-10-13'!$Q19","v":20},{"$f":"'3-11-13'!$Q19","v":0},{"$f":"'10-11-13'!$Q19","v":5},{"$f":"'17-11-13'!$Q19","v":2},{"$f":"'24-11-13'!$Q19","v":12},{"$f":"'1-12-13'!$Q19","v":6},{"$f":"'8-12-13'!$Q19","v":0},{"$f":"'15-12-13'!$Q19","v":0},{"$f":"'12-01-14'!$Q19","v":0},{"$f":"'19-01-14'!$Q19","v":0},{"$f":"'26-01-14'!$Q19","v":0},{"$f":"'2-02-14'!$Q19","v":0},{"$f":"'9-02-14'!$Q19","v":0},{"$f":"'16-02-14'!$Q19","v":0},{"$f":"'23-02-14'!$Q19","v":0},{"$f":"'16-03-14'!$Q19","v":0},{"$f":"'23-03-14'!$Q19","v":0},{"$f":"'30-03-14'!$Q19","v":0},{"$f":"'11-03-12'!$Q19","v":0},{"$f":"'18-03-12'!$Q19","v":0},{"$f":"'25-03-12'!$Q37","v":0},85,5]
[6,"RAG & FAMISH HOTEL",{"$f":"'13-10-13'!Q20","v":20},{"$f":"'20-10-13'!Q20","v":20},{"$f":"'27-10-13'!$Q20","v":20},{"$f":"'3-11-13'!$Q20","v":0},{"$f":"'10-11-13'!$Q20","v":14},{"$f":"'17-11-13'!$Q20","v":6},{"$f":"'24-11-13'!$Q20","v":20},{"$f":"'1-12-13'!$Q20","v":1},{"$f":"'8-12-13'!$Q20","v":0},{"$f":"'15-12-13'!$Q20","v":0},{"$f":"'12-01-14'!$Q20","v":0},{"$f":"'19-01-14'!$Q20","v":0},{"$f":"'26-01-14'!$Q20","v":0},{"$f":"'2-02-14'!$Q20","v":0},{"$f":"'9-02-14'!$Q20","v":0},{"$f":"'16-02-14'!$Q20","v":0},{"$f":"'23-02-14'!$Q20","v":0},{"$f":"'16-03-14'!$Q20","v":0},{"$f":"'23-03-14'!$Q20","v":0},{"$f":"'30-03-14'!$Q20","v":0},{"$f":"'11-03-12'!$Q20","v":0},{"$f":"'18-03-12'!$Q20","v":0},{"$f":"'25-03-12'!$Q38","v":0},101,6]
[7,"GOTTA LOVE IT 7",{"$f":"'13-10-13'!Q21","v":20},{"$f":"'20-10-13'!Q21","v":20},{"$f":"'27-10-13'!$Q21","v":20},{"$f":"'3-11-13'!$Q21","v":0},{"$f":"'10-11-13'!$Q21","v":3},{"$f":"'17-11-13'!$Q21","v":20},{"$f":"'24-11-13'!$Q21","v":11},{"$f":"'1-12-13'!$Q21","v":15},{"$f":"'8-12-13'!$Q21","v":0},{"$f":"'15-12-13'!$Q21","v":0},{"$f":"'12-01-14'!$Q21","v":0},{"$f":"'19-01-14'!$Q21","v":0},{"$f":"'26-01-14'!$Q21","v":0},{"$f":"'2-02-14'!$Q21","v":0},{"$f":"'9-02-14'!$Q21","v":0},{"$f":"'16-02-14'!$Q21","v":0},{"$f":"'23-02-14'!$Q21","v":0},{"$f":"'16-03-14'!$Q21","v":0},{"$f":"'23-03-14'!$Q21","v":0},{"$f":"'30-03-14'!$Q21","v":0},{"$f":"'11-03-12'!$Q21","v":0},{"$f":"'18-03-12'!$Q21","v":0},{"$f":"'25-03-12'!$Q39","v":0},109,7,null,null,null,null,null,null,null,null,null,{"$f":"AI41+AJ41","v":0}]
[8,"SMEG",{"$f":"'13-10-13'!Q22","v":1},{"$f":"'20-10-13'!Q22","v":11},{"$f":"'27-10-13'!$Q22","v":2},{"$f":"'3-11-13'!$Q22","v":0},{"$f":"'10-11-13'!$Q22","v":10},{"$f":"'17-11-13'!$Q22","v":12},{"$f":"'24-11-13'!$Q22","v":7},{"$f":"'1-12-13'!$Q22","v":8},{"$f":"'8-12-13'!$Q22","v":0},{"$f":"'15-12-13'!$Q22","v":0},{"$f":"'12-01-14'!$Q22","v":0},{"$f":"'19-01-14'!$Q22","v":0},{"$f":"'26-01-14'!$Q22","v":0},{"$f":"'2-02-14'!$Q22","v":0},{"$f":"'9-02-14'!$Q22","v":0},{"$f":"'16-02-14'!$Q22","v":0},{"$f":"'23-02-14'!$Q22","v":0},{"$f":"'16-03-14'!$Q22","v":0},{"$f":"'23-03-14'!$Q22","v":0},{"$f":"'30-03-14'!$Q22","v":0},{"$f":"'11-03-12'!$Q22","v":0},{"$f":"'18-03-12'!$Q22","v":0},{"$f":"'25-03-12'!$Q40","v":0},51,8,null,null,null,null,null,null,null,null,null,{"$f":"AI42+AJ42","v":0}]
[9,"PURE BLONDE",{"$f":"'13-10-13'!Q23","v":20},{"$f":"'20-10-13'!Q23","v":8},{"$f":"'27-10-13'!$Q23","v":10},{"$f":"'3-11-13'!$Q23","v":0},{"$f":"'10-11-13'!$Q23","v":2},{"$f":"'17-11-13'!$Q23","v":20},{"$f":"'24-11-13'!$Q23","v":20},{"$f":"'1-12-13'!$Q23","v":20},{"$f":"'8-12-13'!$Q23","v":0},{"$f":"'15-12-13'!$Q23","v":0},{"$f":"'12-01-14'!$Q23","v":0},{"$f":"'19-01-14'!$Q23","v":0},{"$f":"'26-01-14'!$Q23","v":0},{"$f":"'2-02-14'!$Q23","v":0},{"$f":"'9-02-14'!$Q23","v":0},{"$f":"'16-02-14'!$Q23","v":0},{"$f":"'23-02-14'!$Q23","v":0},{"$f":"'16-03-14'!$Q23","v":0},{"$f":"'23-03-14'!$Q23","v":0},{"$f":"'30-03-14'!$Q23","v":0},{"$f":"'11-03-12'!$Q23","v":0},{"$f":"'18-03-12'!$Q23","v":0},{"$f":"'25-03-12'!$Q41","v":0},100,9]
[10,"FISHER & PAYKEL",{"$f":"'13-10-13'!Q24","v":20},{"$f":"'20-10-13'!Q24","v":9},{"$f":"'27-10-13'!$Q24","v":3},{"$f":"'3-11-13'!$Q24","v":0},{"$f":"'10-11-13'!$Q24","v":11},{"$f":"'17-11-13'!$Q24","v":7},{"$f":"'24-11-13'!$Q24","v":5},{"$f":"'1-12-13'!$Q24","v":13},{"$f":"'8-12-13'!$Q24","v":0},{"$f":"'15-12-13'!$Q24","v":0},{"$f":"'12-01-14'!$Q24","v":0},{"$f":"'19-01-14'!$Q24","v":0},{"$f":"'26-01-14'!$Q24","v":0},{"$f":"'2-02-14'!$Q24","v":0},{"$f":"'9-02-14'!$Q24","v":0},{"$f":"'16-02-14'!$Q24","v":0},{"$f":"'23-02-14'!$Q24","v":0},{"$f":"'16-03-14'!$Q24","v":0},{"$f":"'23-03-14'!$Q24","v":0},{"$f":"'30-03-14'!$Q24","v":0},{"$f":"'11-03-12'!$Q24","v":0},{"$f":"'18-03-12'!$Q24","v":0},{"$f":"'25-03-12'!$Q42","v":0},68,10]
[11,"RED CLAW",{"$f":"'13-10-13'!Q25","v":20},{"$f":"'20-10-13'!Q25","v":3},{"$f":"'27-10-13'!$Q25","v":7},{"$f":"'3-11-13'!$Q25","v":0},{"$f":"'10-11-13'!$Q25","v":20},{"$f":"'17-11-13'!$Q25","v":8},{"$f":"'24-11-13'!$Q25","v":3},{"$f":"'1-12-13'!$Q25","v":2},{"$f":"'8-12-13'!$Q25","v":0},{"$f":"'15-12-13'!$Q25","v":0},{"$f":"'12-01-14'!$Q25","v":0},{"$f":"'19-01-14'!$Q25","v":0},{"$f":"'26-01-14'!$Q25","v":0},{"$f":"'2-02-14'!$Q25","v":0},{"$f":"'9-02-14'!$Q25","v":0},{"$f":"'16-02-14'!$Q25","v":0},{"$f":"'23-02-14'!$Q25","v":0},{"$f":"'16-03-14'!$Q25","v":0},{"$f":"'23-03-14'!$Q25","v":0},{"$f":"'30-03-14'!$Q25","v":0},{"$f":"'11-03-12'!$Q25","v":0},{"$f":"'18-03-12'!$Q25","v":0},{"$f":"'25-03-12'!$Q43","v":0},63,11]
[12,"PANASONIC",{"$f":"'13-10-13'!Q26","v":20},{"$f":"'20-10-13'!Q26","v":1},{"$f":"'27-10-13'!$Q26","v":1},{"$f":"'3-11-13'!$Q26","v":0},{"$f":"'10-11-13'!$Q26","v":7},{"$f":"'17-11-13'!$Q26","v":3},{"$f":"'24-11-13'!$Q26","v":20},{"$f":"'1-12-13'!$Q26","v":11},{"$f":"'8-12-13'!$Q26","v":0},{"$f":"'15-12-13'!$Q26","v":0},{"$f":"'12-01-14'!$Q26","v":0},{"$f":"'19-01-14'!$Q26","v":0},{"$f":"'26-01-14'!$Q26","v":0},{"$f":"'2-02-14'!$Q26","v":0},{"$f":"'9-02-14'!$Q26","v":0},{"$f":"'16-02-14'!$Q26","v":0},{"$f":"'23-02-14'!$Q26","v":0},{"$f":"'16-03-14'!$Q26","v":0},{"$f":"'23-03-14'!$Q26","v":0},{"$f":"'30-03-14'!$Q26","v":0},{"$f":"'11-03-12'!$Q26","v":0},{"$f":"'18-03-12'!$Q26","v":0},{"$f":"'25-03-12'!$Q44","v":0},63,12]
[13,"KENWOOD-RABBITOHS",{"$f":"'13-10-13'!Q27","v":2},{"$f":"'20-10-13'!Q27","v":10},{"$f":"'27-10-13'!$Q27","v":5},{"$f":"'3-11-13'!$Q27","v":0},{"$f":"'10-11-13'!$Q27","v":1},{"$f":"'17-11-13'!$Q27","v":13},{"$f":"'24-11-13'!$Q27","v":1},{"$f":"'1-12-13'!$Q27","v":5},{"$f":"'8-12-13'!$Q27","v":0},{"$f":"'15-12-13'!$Q27","v":0},{"$f":"'12-01-14'!$Q27","v":0},{"$f":"'19-01-14'!$Q27","v":0},{"$f":"'26-01-14'!$Q27","v":0},{"$f":"'2-02-14'!$Q27","v":0},{"$f":"'9-02-14'!$Q27","v":0},{"$f":"'16-02-14'!$Q27","v":0},{"$f":"'23-02-14'!$Q27","v":0},{"$f":"'16-03-14'!$Q27","v":0},{"$f":"'23-03-14'!$Q27","v":0},{"$f":"'30-03-14'!$Q27","v":0},{"$f":"'11-03-12'!$Q27","v":0},{"$f":"'18-03-12'!$Q27","v":0},{"$f":"'25-03-12'!$Q45","v":0},37,13]
[14,"TF COLLECT",{"$f":"'13-10-13'!Q28","v":20},{"$f":"'20-10-13'!Q28","v":6},{"$f":"'27-10-13'!$Q28","v":14},{"$f":"'3-11-13'!$Q28","v":0},{"$f":"'10-11-13'!$Q28","v":6},{"$f":"'17-11-13'!$Q28","v":4},{"$f":"'24-11-13'!$Q28","v":9},{"$f":"'1-12-13'!$Q28","v":20},{"$f":"'8-12-13'!$Q28","v":0},{"$f":"'15-12-13'!$Q28","v":0},{"$f":"'12-01-14'!$Q28","v":0},{"$f":"'19-01-14'!$Q28","v":0},{"$f":"'26-01-14'!$Q28","v":0},{"$f":"'2-02-14'!$Q28","v":0},{"$f":"'9-02-14'!$Q28","v":0},{"$f":"'16-02-14'!$Q28","v":0},{"$f":"'23-02-14'!$Q28","v":0},{"$f":"'16-03-14'!$Q28","v":0},{"$f":"'23-03-14'!$Q28","v":0},{"$f":"'30-03-14'!$Q28","v":0},{"$f":"'11-03-12'!$Q28","v":0},{"$f":"'18-03-12'!$Q28","v":0},{"$f":"'25-03-12'!$Q46","v":0},79,14]
[15,"THE KITCHEN MAKER",{"$f":"'13-10-13'!Q29","v":20},{"$f":"'20-10-13'!Q29","v":12},{"$f":"'27-10-13'!$Q29","v":8},{"$f":"'3-11-13'!$Q29","v":0},{"$f":"'10-11-13'!$Q29","v":15},{"$f":"'17-11-13'!$Q29","v":9},{"$f":"'24-11-13'!$Q29","v":8},{"$f":"'1-12-13'!$Q29","v":16},{"$f":"'8-12-13'!$Q29","v":0},{"$f":"'15-12-13'!$Q29","v":0},{"$f":"'12-01-14'!$Q29","v":0},{"$f":"'19-01-14'!$Q29","v":0},{"$f":"'26-01-14'!$Q29","v":0},{"$f":"'2-02-14'!$Q29","v":0},{"$f":"'9-02-14'!$Q29","v":0},{"$f":"'16-02-14'!$Q29","v":0},{"$f":"'23-02-14'!$Q29","v":0},{"$f":"'16-03-14'!$Q29","v":0},{"$f":"'23-03-14'!$Q29","v":0},{"$f":"'30-03-14'!$Q29","v":0},{"$f":"'11-03-12'!$Q29","v":0},{"$f":"'18-03-12'!$Q29","v":0},{"$f":"'25-03-12'!$Q47","v":0},88,15]
[16,"PROJECT RACING",{"$f":"'13-10-13'!Q30","v":20},{"$f":"'20-10-13'!Q30","v":13},{"$f":"'27-10-13'!$Q30","v":20},{"$f":"'3-11-13'!$Q30","v":0},{"$f":"'10-11-13'!$Q30","v":9},{"$f":"'17-11-13'!$Q30","v":20},{"$f":"'24-11-13'!$Q30","v":10},{"$f":"'1-12-13'!$Q30","v":3},{"$f":"'8-12-13'!$Q30","v":0},{"$f":"'15-12-13'!$Q30","v":0},{"$f":"'12-01-14'!$Q30","v":0},{"$f":"'19-01-14'!$Q30","v":0},{"$f":"'26-01-14'!$Q30","v":0},{"$f":"'2-02-14'!$Q30","v":0},{"$f":"'9-02-14'!$Q30","v":0},{"$f":"'16-02-14'!$Q30","v":0},{"$f":"'23-02-14'!$Q30","v":0},{"$f":"'16-03-14'!$Q30","v":0},{"$f":"'23-03-14'!$Q30","v":0},{"$f":"'30-03-14'!$Q30","v":0},{"$f":"'11-03-12'!$Q30","v":0},{"$f":"'18-03-12'!$Q30","v":0},{"$f":"'25-03-12'!$Q48","v":0},95,16]
[17,"TEAM PARKINSON",{"$f":"'13-10-13'!Q31","v":20},{"$f":"'20-10-13'!Q31","v":15},{"$f":"'27-10-13'!$Q31","v":11},{"$f":"'3-11-13'!$Q31","v":0},{"$f":"'10-11-13'!$Q31","v":16},{"$f":"'17-11-13'!$Q31","v":15},{"$f":"'24-11-13'!$Q31","v":15},{"$f":"'1-12-13'!$Q31","v":14},{"$f":"'8-12-13'!$Q31","v":0},{"$f":"'15-12-13'!$Q31","v":0},{"$f":"'12-01-14'!$Q31","v":0},{"$f":"'19-01-14'!$Q31","v":0},{"$f":"'26-01-14'!$Q31","v":0},{"$f":"'2-02-14'!$Q31","v":0},{"$f":"'9-02-14'!$Q31","v":0},{"$f":"'16-02-14'!$Q31","v":0},{"$f":"'23-02-14'!$Q31","v":0},{"$f":"'16-03-14'!$Q31","v":0},{"$f":"'23-03-14'!$Q31","v":0},{"$f":"'30-03-14'!$Q31","v":0},{"$f":"'11-03-12'!$Q31","v":0},{"$f":"'18-03-12'!$Q31","v":0},{"$f":"'25-03-12'!$Q49","v":0},106,17]
[18,null,{"$f":"'13-10-13'!Q32","v":20},{"$f":"'20-10-13'!Q32","v":20},{"$f":"'27-10-13'!$Q32","v":13},{"$f":"'3-11-13'!$Q32","v":0},{"$f":"'10-11-13'!$Q32","v":20},{"$f":"'17-11-13'!$Q32","v":20},{"$f":"'24-11-13'!$Q33","v":14},{"$f":"'1-12-13'!$Q33","v":10},{"$f":"'8-12-13'!$Q33","v":0},{"$f":"'15-12-13'!$Q33","v":0},{"$f":"'12-01-14'!$Q33","v":0},{"$f":"'19-01-14'!$Q33","v":0},{"$f":"'26-01-14'!$Q33","v":0},{"$f":"'2-02-14'!$Q33","v":0},{"$f":"'9-02-14'!$Q33","v":0},{"$f":"'16-02-14'!$Q33","v":0},{"$f":"'23-02-14'!$Q33","v":0},{"$f":"'16-03-14'!$Q33","v":0},{"$f":"'23-03-14'!$Q33","v":0},{"$f":"'30-03-14'!$Q33","v":0},{"$f":"'11-03-12'!$Q33","v":0},{"$f":"'18-03-12'!$Q33","v":0},{"$f":"'25-03-12'!$Q23","v":0},null,18]
[19,null,{"$f":"'13-10-13'!Q33","v":20},{"$f":"'20-10-13'!Q33","v":14},{"$f":"'27-10-13'!$Q33","v":12},{"$f":"'3-11-13'!$Q33","v":0},{"$f":"'10-11-13'!$Q33","v":20},{"$f":"'17-11-13'!$Q33","v":14},{"$f":"'24-11-13'!$Q34","v":20},{"$f":"'1-12-13'!$Q34","v":20},{"$f":"'8-12-13'!$Q34","v":0},{"$f":"'15-12-13'!$Q34","v":0},{"$f":"'12-01-14'!$Q34","v":0},{"$f":"'19-01-14'!$Q34","v":0},{"$f":"'26-01-14'!$Q34","v":0},{"$f":"'2-02-14'!$Q34","v":0},{"$f":"'9-02-14'!$Q34","v":0},{"$f":"'16-02-14'!$Q34","v":0},{"$f":"'23-02-14'!$Q34","v":0},{"$f":"'16-03-14'!$Q34","v":0},{"$f":"'23-03-14'!$Q34","v":0},{"$f":"'30-03-14'!$Q34","v":0},{"$f":"'11-03-12'!$Q34","v":0},{"$f":"'18-03-12'!$Q34","v":0},{"$f":"'25-03-12'!$Q26","v":0},null,19,null,null,null,null,null,null,null,"NB These cells have white forground to hide data"]
[20,null,{"$f":"'13-10-13'!Q34","v":20},{"$f":"'20-10-13'!Q34","v":20},{"$f":"'27-10-13'!$Q34","v":20},{"$f":"'3-11-13'!$Q34","v":0},{"$f":"'10-11-13'!$Q34","v":20},{"$f":"'17-11-13'!$Q34","v":20},{"$f":"'24-11-13'!$Q35","v":20},{"$f":"'1-12-13'!$Q35","v":20},{"$f":"'8-12-13'!$Q35","v":0},{"$f":"'15-12-13'!$Q35","v":0},{"$f":"'12-01-14'!$Q35","v":0},{"$f":"'19-01-14'!$Q35","v":0},{"$f":"'26-01-14'!$Q35","v":0},{"$f":"'2-02-14'!$Q35","v":0},{"$f":"'9-02-14'!$Q35","v":0},{"$f":"'16-02-14'!$Q35","v":0},{"$f":"'23-02-14'!$Q35","v":0},{"$f":"'16-03-14'!$Q35","v":0},{"$f":"'23-03-14'!$Q35","v":0},{"$f":"'30-03-14'!$Q35","v":0},{"$f":"'11-03-12'!$Q35","v":0},{"$f":"'18-03-12'!$Q35","v":0},{"$f":"'25-03-12'!$Q30","v":0},null,20]
[22,null,{"$f":"'13-10-13'!Q36","v":20},{"$f":"'20-10-13'!Q36","v":20},{"$f":"'27-10-13'!$Q36","v":20},{"$f":"'3-11-13'!$Q36","v":0},{"$f":"'10-11-13'!$Q36","v":20},{"$f":"'17-11-13'!$Q36","v":20},{"$f":"'24-11-13'!$Q37","v":20},{"$f":"'1-12-13'!$Q37","v":20},{"$f":"'8-12-13'!$Q37","v":0},{"$f":"'15-12-13'!$Q37","v":0},{"$f":"'12-01-14'!$Q37","v":0},{"$f":"'19-01-14'!$Q37","v":0},{"$f":"'26-01-14'!$Q37","v":0},{"$f":"'2-02-14'!$Q37","v":0},{"$f":"'9-02-14'!$Q37","v":0},{"$f":"'16-02-14'!$Q37","v":0},{"$f":"'23-02-14'!$Q37","v":0},{"$f":"'16-03-14'!$Q37","v":0},{"$f":"'23-03-14'!$Q37","v":0},{"$f":"'30-03-14'!$Q37","v":0},{"$f":"'11-03-12'!$Q37","v":0},{"$f":"'18-03-12'!$Q37","v":0},{"$f":"'25-03-12'!$Q28","v":0},null,21]
[23,null,{"$f":"'13-10-13'!Q35","v":20},{"$f":"'20-10-13'!Q35","v":20},{"$f":"'27-10-13'!$Q35","v":20},{"$f":"'3-11-13'!$Q35","v":0},{"$f":"'10-11-13'!$Q35","v":20},{"$f":"'17-11-13'!$Q35","v":20},{"$f":"'24-11-13'!$Q36","v":20},{"$f":"'1-12-13'!$Q36","v":20},{"$f":"'8-12-13'!$Q36","v":0},{"$f":"'15-12-13'!$Q36","v":0},{"$f":"'12-01-14'!$Q36","v":0},{"$f":"'19-01-14'!$Q36","v":0},{"$f":"'26-01-14'!$Q36","v":0},{"$f":"'2-02-14'!$Q36","v":0},{"$f":"'9-02-14'!$Q36","v":0},{"$f":"'16-02-14'!$Q36","v":0},{"$f":"'23-02-14'!$Q36","v":0},{"$f":"'16-03-14'!$Q36","v":0},{"$f":"'23-03-14'!$Q36","v":0},{"$f":"'30-03-14'!$Q36","v":0},{"$f":"'11-03-12'!$Q36","v":0},{"$f":"'18-03-12'!$Q36","v":0},{"$f":"'25-03-12'!$Q37","v":0},null,22]
[null,null,null,null,null,null,{"$f":"'10-11-13'!$Q32","v":20},{"$f":"'17-11-13'!$Q32","v":20},{"$f":"'24-11-13'!$Q32","v":20},{"$f":"'1-12-13'!$Q32","v":17},{"$f":"'8-12-13'!$Q32","v":0},{"$f":"'15-12-13'!$Q32","v":0},{"$f":"'12-01-14'!$Q32","v":0},{"$f":"'19-01-14'!$Q32","v":0},{"$f":"'26-01-14'!$Q32","v":0},{"$f":"'2-02-14'!$Q32","v":0},{"$f":"'9-02-14'!$Q32","v":0},{"$f":"'16-02-14'!$Q32","v":0},{"$f":"'23-02-14'!$Q32","v":0},{"$f":"'16-03-14'!$Q32","v":0},{"$f":"'23-03-14'!$Q32","v":0},{"$f":"'30-03-14'!$Q32","v":0},{"$f":"'11-03-12'!$Q32","v":0},{"$f":"'18-03-12'!$Q32","v":0},{"$f":"'25-03-12'!$Q38","v":0},null,23]
["Notes:"]
[]
[]
["AUSTRALIAN 18Ft League - 2011/12 NSW Championship Pointscore"]
[null,"Best 4 results will count.",{"$f":"'10-11-13'!$G4","v":"2013-11-10"},{"$f":"'17-11-13'!$G4","v":"2013-11-17"},{"$f":"'24-11-13'!$G4","v":"2013-11-24"},{"$f":"'1-12-13'!$G4","v":"2013-12-01"},{"$f":"'8-12-13'!$G4","v":"2013-12-08"},1,"Drop"]
["Recall #","Name","R1","R2","R3","R4","R5","Total","Total","POS"]
[1,"THURLOW FISHER LAWYERS",{"$f":"'10-11-13'!$P15","v":2},{"$f":"'17-11-13'!$P15","v":1},{"$f":"'24-11-13'!$P15","v":4},{"$f":"'1-12-13'!$P15","v":9},{"$f":"'8-12-13'!$P15","v":0},{"$f":"SUM(C64:G64)","v":16},{"$f":"IF(H$62=1,SUM(C64:G64)-MAX(C64:G64),SUM(C64:G64))","v":7},1]
[2,"YANDOO",{"$f":"'10-11-13'!$P16","v":12},{"$f":"'17-11-13'!$P16","v":5},{"$f":"'24-11-13'!$P16","v":6},{"$f":"'1-12-13'!$P16","v":7},{"$f":"'8-12-13'!$P16","v":0},30,18,2]
[3,"ASKO APPLIANCES",{"$f":"'10-11-13'!$P17","v":11},{"$f":"'17-11-13'!$P17","v":11},{"$f":"'24-11-13'!$P17","v":2},{"$f":"'1-12-13'!$P17","v":4},{"$f":"'8-12-13'!$P17","v":0},28,17,3]
[4,"DE'LONGHI",{"$f":"'10-11-13'!$P18","v":13},{"$f":"'17-11-13'!$P18","v":10},{"$f":"'24-11-13'!$P18","v":13},{"$f":"'1-12-13'!$P18","v":12},{"$f":"'8-12-13'!$P18","v":0},48,35,4]
[5,"APPLIANCESONLINE.COM.AU",{"$f":"'10-11-13'!$P19","v":5},{"$f":"'17-11-13'!$P19","v":2},{"$f":"'24-11-13'!$P19","v":12},{"$f":"'1-12-13'!$P19","v":6},{"$f":"'8-12-13'!$P19","v":0},25,13,5]
[6,"RAG & FAMISH HOTEL",{"$f":"'10-11-13'!$P20","v":9},{"$f":"'17-11-13'!$P20","v":6},{"$f":"'24-11-13'!$P20","v":20},{"$f":"'1-12-13'!$P20","v":1},{"$f":"'8-12-13'!$P20","v":0},36,16,6]
[7,"GOTTA LOVE IT 7",{"$f":"'10-11-13'!$P21","v":1},{"$f":"'17-11-13'!$P21","v":20},{"$f":"'24-11-13'!$P21","v":11},{"$f":"'1-12-13'!$P21","v":15},{"$f":"'8-12-13'!$P21","v":0},47,27,7]
[8,"SMEG",{"$f":"'10-11-13'!$P22","v":3},{"$f":"'17-11-13'!$P22","v":12},{"$f":"'24-11-13'!$P22","v":7},{"$f":"'1-12-13'!$P22","v":8},{"$f":"'8-12-13'!$P22","v":0},30,18,8]
[9,"PURE BLONDE",{"$f":"'10-11-13'!$P23","v":10},{"$f":"'17-11-13'!$P23","v":20},{"$f":"'24-11-13'!$P23","v":20},{"$f":"'1-12-13'!$P23","v":20},{"$f":"'8-12-13'!$P23","v":0},70,50,9]
[10,"FISHER & PAYKEL",{"$f":"'10-11-13'!$P24","v":7},{"$f":"'17-11-13'!$P24","v":7},{"$f":"'24-11-13'!$P24","v":5},{"$f":"'1-12-13'!$P24","v":13},{"$f":"'8-12-13'!$P24","v":0},32,19,10]
[11,"RED CLAW",{"$f":"'10-11-13'!$P25","v":20},{"$f":"'17-11-13'!$P25","v":8},{"$f":"'24-11-13'!$P25","v":3},{"$f":"'1-12-13'!$P25","v":2},{"$f":"'8-12-13'!$P25","v":0},33,13,11]
[12,"PANASONIC",{"$f":"'10-11-13'!$P26","v":6},{"$f":"'17-11-13'!$P26","v":3},{"$f":"'24-11-13'!$P26","v":20},{"$f":"'1-12-13'!$P26","v":11},{"$f":"'8-12-13'!$P26","v":0},40,20,12]
[13,"KENWOOD",{"$f":"'10-11-13'!$P27","v":8},{"$f":"'17-11-13'!$P27","v":13},{"$f":"'24-11-13'!$P27","v":1},{"$f":"'1-12-13'!$P27","v":5},{"$f":"'8-12-13'!$P27","v":0},27,14,13]
[14,"TF COLLECT",{"$f":"'10-11-13'!$P28","v":14},{"$f":"'17-11-13'!$P28","v":4},{"$f":"'24-11-13'!$P28","v":9},{"$f":"'1-12-13'!$P28","v":20},{"$f":"'8-12-13'!$P28","v":0},47,27,14]
[15,"THE KITCHEN MAKER",{"$f":"'10-11-13'!$P29","v":15},{"$f":"'17-11-13'!$P29","v":9},{"$f":"'24-11-13'!$P29","v":8},{"$f":"'1-12-13'!$P29","v":16},{"$f":"'8-12-13'!$P29","v":0},48,32,15]
[16,"PROJECT RACING",{"$f":"'10-11-13'!$P30","v":4},{"$f":"'17-11-13'!$P30","v":20},{"$f":"'24-11-13'!$P30","v":10},{"$f":"'1-12-13'!$P30","v":3},{"$f":"'8-12-13'!$P30","v":0},37,17,16]
[17,"TEAM PARKINSON",{"$f":"'10-11-13'!$P31","v":16},{"$f":"'17-11-13'!$P31","v":15},{"$f":"'24-11-13'!$P31","v":15},{"$f":"'1-12-13'!$P31","v":14},{"$f":"'8-12-13'!$P31","v":0},60,44,17]
[18,null,{"$f":"'10-11-13'!$P32","v":20},{"$f":"'17-11-13'!$P32","v":20},{"$f":"'24-11-13'!$P32","v":20},{"$f":"'1-12-13'!$P32","v":17},{"$f":"'8-12-13'!$P32","v":0},77,57,18]
[19,null,{"$f":"'10-11-13'!$P33","v":20},{"$f":"'17-11-13'!$P33","v":14},{"$f":"'24-11-13'!$P33","v":14},{"$f":"'1-12-13'!$P33","v":10},{"$f":"'8-12-13'!$P33","v":0},58,38,19]
[20,null,{"$f":"'10-11-13'!$P34","v":20},{"$f":"'17-11-13'!$P34","v":20},{"$f":"'24-11-13'!$P34","v":20},{"$f":"'1-12-13'!$P34","v":20},{"$f":"'8-12-13'!$P34","v":0},80,60,20]
[21,null,{"$f":"'10-11-13'!$P35","v":20},{"$f":"'17-11-13'!$P35","v":20},{"$f":"'24-11-13'!$P35","v":20},{"$f":"'1-12-13'!$P35","v":20},{"$f":"'8-12-13'!$P35","v":0},80,60,21]
[22,null,{"$f":"'10-11-13'!$P36","v":20},{"$f":"'17-11-13'!$P36","v":20},{"$f":"'24-11-13'!$P36","v":20},{"$f":"'1-12-13'!$P36","v":20},{"$f":"'8-12-13'!$P36","v":0},80,60,22]
[23,null,{"$f":"'10-11-13'!$P37","v":20},{"$f":"'17-11-13'!$P37","v":20},{"$f":"'24-11-13'!$P37","v":20},{"$f":"'1-12-13'!$P37","v":20},{"$f":"'8-12-13'!$P37","v":0},80,60,23]
[null,null,null,null,null,null,null,0,0]
["NOTE:"]
[]
[]
[null,null,null,null,null,null,null,null,null,null,null,null,null,null,null,null,null,null,null,null,null,null,null,null,null,null,"S"]
["Australian 18ft Skiff Championship Pointscore"]
[null,"Best 4 results will count.",{"$f":"'12-01-14'!$G4","v":"2014-01-12"},{"$f":"'19-01-14'!$G4","v":"2014-01-19"},{"$f":"'26-01-14'!$G4","v":"2014-01-26"},{"$f":"'2-02-14'!$G4","v":"2014-02-02"},{"$f":"'9-02-14'!$G4","v":"2014-02-09"},null,1,"DROP"]
["Recall","Name","R1","R2","R3","R4","R5"," ","Total","Total","POS"]
[1,"THURLOW FISHER LAWYERS",{"$f":"'12-01-14'!$P15","v":0},{"$f":"'19-01-14'!$P15","v":0},{"$f":"'26-01-14'!$P15","v":0},{"$f":"'2-02-14'!$P15","v":0},{"$f":"'9-02-14'!$P15","v":0},null,{"$f":"SUM(C95:H95)","v":0},{"$f":"IF(I$93=1,SUM(C95:H95)-MAX(C95:H95),SUM(C95:H95))","v":0},1]
[2,"YANDOO",{"$f":"'12-01-14'!$P16","v":0},{"$f":"'19-01-14'!$P16","v":0},{"$f":"'26-01-14'!$P16","v":0},{"$f":"'2-02-14'!$P16","v":0},{"$f":"'9-02-14'!$P16","v":0},null,0,0,2]
[3,"ASKO APPLIANCES",{"$f":"'12-01-14'!$P17","v":0},{"$f":"'19-01-14'!$P17","v":0},{"$f":"'26-01-14'!$P17","v":0},6.1,{"$f":"'9-02-14'!$P17","v":0},null,6.1,0,3]
[4,"DE'LONGHI-RABBITOHS",{"$f":"'12-01-14'!$P18","v":0},{"$f":"'19-01-14'!$P18","v":0},{"$f":"'26-01-14'!$P18","v":0},{"$f":"'2-02-14'!$P18","v":0},{"$f":"'9-02-14'!$P18","v":0},null,0,0,4]
[5,"APPLIANCESONLINE.COM.AU",{"$f":"'12-01-14'!$P19","v":0},{"$f":"'19-01-14'!$P19","v":0},{"$f":"'26-01-14'!$P19","v":0},{"$f":"'2-02-14'!$P19","v":0},{"$f":"'9-02-14'!$P19","v":0},null,0,0,5]
[6,"RAG & FAMISH HOTEL",{"$f":"'12-01-14'!$P20","v":0},{"$f":"'19-01-14'!$P20","v":0},{"$f":"'26-01-14'!$P20","v":0},{"$f":"'2-02-14'!$P20","v":0},{"$f":"'9-02-14'!$P20","v":0},null,0,0,6]
[7,"GOTTA LOVE IT 7",{"$f":"'12-01-14'!$P21","v":0},{"$f":"'19-01-14'!$P21","v":0},{"$f":"'26-01-14'!$P21","v":0},{"$f":"'2-02-14'!$P21","v":0},{"$f":"'9-02-14'!$P21","v":0},null,0,0,7]
[8,"SMEG",{"$f":"'12-01-14'!$P22","v":0},{"$f":"'19-01-14'!$P22","v":0},{"$f":"'26-01-14'!$P22","v":0},{"$f":"'2-02-14'!$P22","v":0},{"$f":"'9-02-14'!$P22","v":0},null,0,0,8]
[9,"PURE BLONDE",{"$f":"'12-01-14'!$P23","v":0},{"$f":"'19-01-14'!$P23","v":0},{"$f":"'26-01-14'!$P23","v":0},{"$f":"'2-02-14'!$P23","v":0},{"$f":"'9-02-14'!$P23","v":0},null,0,0,9]
[10,"FISHER & PAYKEL",{"$f":"'12-01-14'!$P24","v":0},{"$f":"'19-01-14'!$P24","v":0},{"$f":"'26-01-14'!$P24","v":0},{"$f":"'2-02-14'!$P24","v":0},{"$f":"'9-02-14'!$P24","v":0},null,0,0,10]
[11,"RED CLAW",{"$f":"'12-01-14'!$P25","v":0},{"$f":"'19-01-14'!$P25","v":0},{"$f":"'26-01-14'!$P25","v":0},5.0999999999999996,{"$f":"'9-02-14'!$P25","v":0},null,5.0999999999999996,0,11]
[12,"PANASONIC",{"$f":"'12-01-14'!$P26","v":0},{"$f":"'19-01-14'!$P26","v":0},{"$f":"'26-01-14'!$P26","v":0},{"$f":"'2-02-14'!$P26","v":0},{"$f":"'9-02-14'!$P26","v":0},null,0,0,12]
[13,"KENWOOD-RABBITOHS",{"$f":"'12-01-14'!$P27","v":0},{"$f":"'19-01-14'!$P27","v":0},{"$f":"'26-01-14'!$P27","v":0},{"$f":"'2-02-14'!$P27","v":0},{"$f":"'9-02-14'!$P27","v":0},null,0,0,13]
[14,"TF COLLECT",{"$f":"'12-01-14'!$P28","v":0},{"$f":"'19-01-14'!$P28","v":0},{"$f":"'26-01-14'!$P28","v":0},12.1,{"$f":"'9-02-14'!$P28","v":0},null,12.1,0,14]
[15,"THE KITCHEN MAKER",{"$f":"'12-01-14'!$P29","v":0},{"$f":"'19-01-14'!$P29","v":0},{"$f":"'26-01-14'!$P29","v":0},{"$f":"'2-02-14'!$P29","v":0},{"$f":"'9-02-14'!$P29","v":0},null,0,0,15]
[16,"PROJECT RACING",{"$f":"'12-01-14'!$P30","v":0},{"$f":"'19-01-14'!$P30","v":0},{"$f":"'26-01-14'!$P30","v":0},{"$f":"'2-02-14'!$P30","v":0},{"$f":"'9-02-14'!$P30","v":0},null,0,0,16]
[17,"TEAM PARKINSON",{"$f":"'12-01-14'!$P31","v":0},{"$f":"'19-01-14'!$P31","v":0},{"$f":"'26-01-14'!$P31","v":0},{"$f":"'2-02-14'!$P31","v":0},{"$f":"'9-02-14'!$P31","v":0},null,0,0,17]
[18,"COLDWELL BANKER-SHARKS",{"$f":"'12-01-14'!$P32","v":0},{"$f":"'19-01-14'!$P32","v":0},{"$f":"'26-01-14'!$P32","v":0},{"$f":"'2-02-14'!$P32","v":0},{"$f":"'9-02-14'!$P32","v":0},null,0,0,18]
[19,"SLAM",{"$f":"'12-01-14'!$P33","v":0},{"$f":"'19-01-14'!$P33","v":0},{"$f":"'26-01-14'!$P33","v":0},{"$f":"'2-02-14'!$P33","v":0},{"$f":"'9-02-14'!$P33","v":0},null,0,0,19]
[20,null,{"$f":"'12-01-14'!$P34","v":0},{"$f":"'19-01-14'!$P34","v":0},{"$f":"'26-01-14'!$P34","v":0},{"$f":"'2-02-14'!$P34","v":0},{"$f":"'9-02-14'!$P34","v":0},null,0,0,20]
[21,null,{"$f":"'12-01-14'!$P35","v":0},{"$f":"'19-01-14'!$P35","v":0},{"$f":"'26-01-14'!$P35","v":0},{"$f":"'2-02-14'!$P35","v":0},{"$f":"'9-02-14'!$P35","v":0},null,0,0,21]
[22,null,{"$f":"'12-01-14'!$P36","v":0},{"$f":"'19-01-14'!$P36","v":0},{"$f":"'26-01-14'!$P36","v":0},{"$f":"'2-02-14'!$P36","v":0},{"$f":"'9-02-14'!$P36","v":0},null,0,0,22]
[23,null,{"$f":"'12-01-14'!$P37","v":0},{"$f":"'19-01-14'!$P37","v":0},{"$f":"'26-01-14'!$P37","v":0},{"$f":"'2-02-14'!$P37","v":0},{"$f":"'9-02-14'!$P37","v":0},null,0,0,23]
[24,null,{"$f":"'12-01-14'!$P38","v":0},{"$f":"'19-01-14'!$P38","v":0},{"$f":"'26-01-14'!$P38","v":0},{"$f":"'2-02-14'!$P38","v":0},{"$f":"'9-02-14'!$P38","v":0},null,0,0,24]
[]
[]
["AUSTRALIAN 18Ft League - 2010/11 J. J. Giltinan Selection Point Score"]
[null,"Best 9 results will count.",{"$f":"'10-11-13'!G4","v":"2013-11-10"},{"$f":"'17-11-13'!G4","v":"2013-11-17"},{"$f":"'15-12-13'!G4","v":"2013-12-15"},{"$f":"'1-12-13'!G4","v":"2013-12-01"},{"$f":"'8-12-13'!G4","v":"2013-12-08"},{"$f":"'12-01-14'!G4","v":"2014-01-12"},{"$f":"'19-01-14'!G4","v":"2014-01-19"},{"$f":"'26-01-14'!G4","v":"2014-01-26"},{"$f":"'2-02-14'!G4","v":"2014-02-02"},{"$f":"'9-02-14'!G4","v":"2014-02-09"},null,null,0,"DROPS"]
["Recall","Name","R1","R2","R3","R4","R5","R6","R7","R8","R9","R10",null," ","Total","Total","POS",null,null,null,null,null,null,null,null,null,null,null,null,null,"Drop1","Drop2"]
[1,"THURLOW FISHER LAWYERS",{"$f":"'3-11-13'!$P15","v":0},{"$f":"'10-11-13'!$P15","v":2},{"$f":"'17-11-13'!$P15","v":1},{"$f":"'15-12-13'!$P15","v":0},{"$f":"'1-12-13'!$P15","v":9},{"$f":"'8-12-13'!$P15","v":0},{"$f":"'12-01-14'!$P15","v":0},{"$f":"'19-01-14'!$P15","v":0},{"$f":"'26-01-14'!$P15","v":0},{"$f":"'2-02-14'!$P15","v":0},null,null,{"$f":"SUM(C124:N124)","v":12},{"$f":"IF(O$122=0,O124,O124-AE123-AF123)","v":12},1,null,null,null,null,null,null,null,null,null,null,null,null,null,{"$f":"MAX(C125:N125)","v":12},{"$f":"LARGE(C125:N125,2)","v":7}]
[2,"YANDOO",{"$f":"'3-11-13'!$P16","v":0},{"$f":"'10-11-13'!$P16","v":12},{"$f":"'17-11-13'!$P16","v":5},{"$f":"'15-12-13'!$P16","v":0},{"$f":"'1-12-13'!$P16","v":7},{"$f":"'8-12-13'!$P16","v":0},{"$f":"'12-01-14'!$P16","v":0},{"$f":"'19-01-14'!$P16","v":0},{"$f":"'26-01-14'!$P16","v":0},{"$f":"'2-02-14'!$P16","v":0},null,null,24,24,2,null,null,null,null,null,null,null,null,null,null,null,null,null,11,11]
[3,"ASKO APPLIANCES",{"$f":"'3-11-13'!$P17","v":0},{"$f":"'10-11-13'!$P17","v":11},{"$f":"'17-11-13'!$P17","v":11},{"$f":"'15-12-13'!$P17","v":0},{"$f":"'1-12-13'!$P17","v":4},{"$f":"'8-12-13'!$P17","v":0},{"$f":"'12-01-14'!$P17","v":0},{"$f":"'19-01-14'!$P17","v":0},{"$f":"'26-01-14'!$P17","v":0},{"$f":"'2-02-14'!$P17","v":0},null,null,26,26,3,null,null,null,null,null,null,null,null,null,null,null,null,null,13,12]
[4,"DE'LONGHI",{"$f":"'3-11-13'!$P18","v":0},{"$f":"'10-11-13'!$P18","v":13},{"$f":"'17-11-13'!$P18","v":10},{"$f":"'15-12-13'!$P18","v":0},{"$f":"'1-12-13'!$P18","v":12},{"$f":"'8-12-13'!$P18","v":0},{"$f":"'12-01-14'!$P18","v":0},{"$f":"'19-01-14'!$P18","v":0},{"$f":"'26-01-14'!$P18","v":0},{"$f":"'2-02-14'!$P18","v":0},null,null,35,35,4,null,null,null,null,null,null,null,null,null,null,null,null,null,6,5]
[5,"APPLIANCESONLINE.COM.AU",{"$f":"'3-11-13'!$P19","v":0},{"$f":"'10-11-13'!$P19","v":5},{"$f":"'17-11-13'!$P19","v":2},{"$f":"'15-12-13'!$P19","v":0},{"$f":"'1-12-13'!$P19","v":6},{"$f":"'8-12-13'!$P19","v":0},{"$f":"'12-01-14'!$P19","v":0},{"$f":"'19-01-14'!$P19","v":0},{"$f":"'26-01-14'!$P19","v":0},{"$f":"'2-02-14'!$P19","v":0},null,null,13,13,5,null,null,null,null,null,null,null,null,null,null,null,null,null,9,6]
[6,"RAG & FAMISH HOTEL",{"$f":"'3-11-13'!$P20","v":0},{"$f":"'10-11-13'!$P20","v":9},{"$f":"'17-11-13'!$P20","v":6},{"$f":"'15-12-13'!$P20","v":0},{"$f":"'1-12-13'!$P20","v":1},{"$f":"'8-12-13'!$P20","v":0},{"$f":"'12-01-14'!$P20","v":0},{"$f":"'19-01-14'!$P20","v":0},{"$f":"'26-01-14'!$P20","v":0},{"$f":"'2-02-14'!$P20","v":0},null,null,16,16,6,null,null,null,null,null,null,null,null,null,null,null,null,null,20,15]
[7,"GOTTA LOVE IT 7",{"$f":"'3-11-13'!$P21","v":0},{"$f":"'10-11-13'!$P21","v":1},{"$f":"'17-11-13'!$P21","v":20},{"$f":"'15-12-13'!$P21","v":0},{"$f":"'1-12-13'!$P21","v":15},{"$f":"'8-12-13'!$P21","v":0},{"$f":"'12-01-14'!$P21","v":0},{"$f":"'19-01-14'!$P21","v":0},{"$f":"'26-01-14'!$P21","v":0},{"$f":"'2-02-14'!$P21","v":0},null,null,36,36,7,null,null,null,null,null,null,null,null,null,null,null,null,null,12,8]
[8,"SMEG",{"$f":"'3-11-13'!$P22","v":0},{"$f":"'10-11-13'!$P22","v":3},{"$f":"'17-11-13'!$P22","v":12},{"$f":"'15-12-13'!$P22","v":0},{"$f":"'1-12-13'!$P22","v":8},{"$f":"'8-12-13'!$P22","v":0},{"$f":"'12-01-14'!$P22","v":0},{"$f":"'19-01-14'!$P22","v":0},{"$f":"'26-01-14'!$P22","v":0},{"$f":"'2-02-14'!$P22","v":0},null,null,23,23,8,null,null,null,null,null,null,null,null,null,null,null,null,null,20,20]
[9,"PURE BLONDE",{"$f":"'3-11-13'!$P23","v":0},{"$f":"'10-11-13'!$P23","v":10},{"$f":"'17-11-13'!$P23","v":20},{"$f":"'15-12-13'!$P23","v":0},{"$f":"'1-12-13'!$P23","v":20},{"$f":"'8-12-13'!$P23","v":0},{"$f":"'12-01-14'!$P23","v":0},{"$f":"'19-01-14'!$P23","v":0},{"$f":"'26-01-14'!$P23","v":0},{"$f":"'2-02-14'!$P23","v":0},null,null,50,50,9,null,null,null,null,null,null,null,null,null,null,null,null,null,13,7]
[10,"FISHER & PAYKEL",{"$f":"'3-11-13'!$P24","v":0},{"$f":"'10-11-13'!$P24","v":7},{"$f":"'17-11-13'!$P24","v":7},{"$f":"'15-12-13'!$P24","v":0},{"$f":"'1-12-13'!$P24","v":13},{"$f":"'8-12-13'!$P24","v":0},{"$f":"'12-01-14'!$P24","v":0},{"$f":"'19-01-14'!$P24","v":0},{"$f":"'26-01-14'!$P24","v":0},{"$f":"'2-02-14'!$P24","v":0},null,null,27,27,10,null,null,null,null,null,null,null,null,null,null,null,null,null,20,8]
[11,"RED CLAW",{"$f":"'3-11-13'!$P25","v":0},{"$f":"'10-11-13'!$P25","v":20},{"$f":"'17-11-13'!$P25","v":8},{"$f":"'15-12-13'!$P25","v":0},{"$f":"'1-12-13'!$P25","v":2},{"$f":"'8-12-13'!$P25","v":0},{"$f":"'12-01-14'!$P25","v":0},{"$f":"'19-01-14'!$P25","v":0},{"$f":"'26-01-14'!$P25","v":0},{"$f":"'2-02-14'!$P25","v":0},null,null,30,30,11,null,null,null,null,null,null,null,null,null,null,null,null,null,11,6]
[12,"PANASONIC",{"$f":"'3-11-13'!$P26","v":0},{"$f":"'10-11-13'!$P26","v":6},{"$f":"'17-11-13'!$P26","v":3},{"$f":"'15-12-13'!$P26","v":0},{"$f":"'1-12-13'!$P26","v":11},{"$f":"'8-12-13'!$P26","v":0},{"$f":"'12-01-14'!$P26","v":0},{"$f":"'19-01-14'!$P26","v":0},{"$f":"'26-01-14'!$P26","v":0},{"$f":"'2-02-14'!$P26","v":0},null,null,20,20,12,null,null,null,null,null,null,null,null,null,null,null,null,null,13,8]
[13,"SHARKS",{"$f":"'3-11-13'!$P27","v":0},{"$f":"'10-11-13'!$P27","v":8},{"$f":"'17-11-13'!$P27","v":13},{"$f":"'15-12-13'!$P27","v":0},{"$f":"'1-12-13'!$P27","v":5},{"$f":"'8-12-13'!$P27","v":0},{"$f":"'12-01-14'!$P27","v":0},{"$f":"'19-01-14'!$P27","v":0},{"$f":"'26-01-14'!$P27","v":0},{"$f":"'2-02-14'!$P27","v":0},null,null,26,26,13,null,null,null,null,null,null,null,null,null,null,null,null,null,20,14]
[14,"TF COLLECT",{"$f":"'3-11-13'!$P28","v":0},{"$f":"'10-11-13'!$P28","v":14},{"$f":"'17-11-13'!$P28","v":4},{"$f":"'15-12-13'!$P28","v":0},{"$f":"'1-12-13'!$P28","v":20},{"$f":"'8-12-13'!$P28","v":0},{"$f":"'12-01-14'!$P28","v":0},{"$f":"'19-01-14'!$P28","v":0},{"$f":"'26-01-14'!$P28","v":0},{"$f":"'2-02-14'!$P28","v":0},null,null,38,38,14,null,null,null,null,null,null,null,null,null,null,null,null,null,16,15]
[15,"THE KITCHEN MAKER",{"$f":"'3-11-13'!$P29","v":0},{"$f":"'10-11-13'!$P29","v":15},{"$f":"'17-11-13'!$P29","v":9},{"$f":"'15-12-13'!$P29","v":0},{"$f":"'1-12-13'!$P29","v":16},{"$f":"'8-12-13'!$P29","v":0},{"$f":"'12-01-14'!$P29","v":0},{"$f":"'19-01-14'!$P29","v":0},{"$f":"'26-01-14'!$P29","v":0},{"$f":"'2-02-14'!$P29","v":0},null,null,40,40,15,null,null,null,null,null,null,null,null,null,null,null,null,null,20,4]
[16,"PROJECT RACING",{"$f":"'3-11-13'!$P30","v":0},{"$f":"'10-11-13'!$P30","v":4},{"$f":"'17-11-13'!$P30","v":20},{"$f":"'15-12-13'!$P30","v":0},{"$f":"'1-12-13'!$P30","v":3},{"$f":"'8-12-13'!$P30","v":0},{"$f":"'12-01-14'!$P30","v":0},{"$f":"'19-01-14'!$P30","v":0},{"$f":"'26-01-14'!$P30","v":0},{"$f":"'2-02-14'!$P30","v":0},null,null,27,27,16,null,null,null,null,null,null,null,null,null,null,null,null,null,16,15]
[17,"COLDWELL BANKER NEW HOMES",{"$f":"'3-11-13'!$P31","v":0},{"$f":"'10-11-13'!$P31","v":16},{"$f":"'17-11-13'!$P31","v":15},{"$f":"'15-12-13'!$P31","v":0},{"$f":"'1-12-13'!$P31","v":14},{"$f":"'8-12-13'!$P31","v":0},{"$f":"'12-01-14'!$P31","v":0},{"$f":"'19-01-14'!$P31","v":0},{"$f":"'26-01-14'!$P31","v":0},{"$f":"'2-02-14'!$P31","v":0},null,null,45,45,17,null,null,null,null,null,null,null,null,null,null,null,null,null,20,20]
[18,"BOATMATE",{"$f":"'3-11-13'!$P32","v":0},{"$f":"'10-11-13'!$P32","v":20},{"$f":"'17-11-13'!$P32","v":20},{"$f":"'15-12-13'!$P32","v":0},{"$f":"'1-12-13'!$P32","v":17},{"$f":"'8-12-13'!$P32","v":0},{"$f":"'12-01-14'!$P32","v":0},{"$f":"'19-01-14'!$P32","v":0},{"$f":"'26-01-14'!$P32","v":0},{"$f":"'2-02-14'!$P32","v":0},null,null,57,57,18,null,null,null,null,null,null,null,null,null,null,null,null,null,20,14]
[19,null,{"$f":"'3-11-13'!$P33","v":0},{"$f":"'10-11-13'!$P33","v":20},{"$f":"'17-11-13'!$P33","v":14},{"$f":"'15-12-13'!$P33","v":0},{"$f":"'1-12-13'!$P33","v":10},{"$f":"'8-12-13'!$P33","v":0},{"$f":"'12-01-14'!$P33","v":0},{"$f":"'19-01-14'!$P33","v":0},{"$f":"'26-01-14'!$P33","v":0},{"$f":"'2-02-14'!$P33","v":0},null,null,44,44,19,null,null,null,null,null,null,null,null,null,null,null,null,null,20,20]
[20,null,{"$f":"'3-11-13'!$P34","v":0},{"$f":"'10-11-13'!$P34","v":20},{"$f":"'17-11-13'!$P34","v":20},{"$f":"'15-12-13'!$P34","v":0},{"$f":"'1-12-13'!$P34","v":20},{"$f":"'8-12-13'!$P34","v":0},{"$f":"'12-01-14'!$P34","v":0},{"$f":"'19-01-14'!$P34","v":0},{"$f":"'26-01-14'!$P34","v":0},{"$f":"'2-02-14'!$P34","v":0},null,null,60,60,20,null,null,null,null,null,null,null,null,null,null,null,null,null,20,20]
[21,null,{"$f":"'3-11-13'!$P35","v":0},{"$f":"'10-11-13'!$P35","v":20},{"$f":"'17-11-13'!$P35","v":20},{"$f":"'15-12-13'!$P35","v":0},{"$f":"'1-12-13'!$P35","v":20},{"$f":"'8-12-13'!$P35","v":0},{"$f":"'12-01-14'!$P35","v":0},{"$f":"'19-01-14'!$P35","v":0},{"$f":"'26-01-14'!$P35","v":0},{"$f":"'2-02-14'!$P35","v":0},null,null,60,60,21,null,null,null,null,null,null,null,null,null,null,null,null,null,20,20]
[22,null,{"$f":"'3-11-13'!$P36","v":0},{"$f":"'10-11-13'!$P36","v":20},{"$f":"'17-11-13'!$P36","v":20},{"$f":"'15-12-13'!$P36","v":0},{"$f":"'1-12-13'!$P36","v":20},{"$f":"'8-12-13'!$P36","v":0},{"$f":"'12-01-14'!$P36","v":0},{"$f":"'19-01-14'!$P36","v":0},{"$f":"'26-01-14'!$P36","v":0},{"$f":"'2-02-14'!$P36","v":0},null,null,60,60,22,null,null,null,null,null,null,null,null,null,null,null,null,null,20,20]
[23,null,{"$f":"'3-11-13'!$P37","v":0},{"$f":"'10-11-13'!$P37","v":20},{"$f":"'17-11-13'!$P37","v":20},{"$f":"'15-12-13'!$P37","v":0},{"$f":"'1-12-13'!$P37","v":20},{"$f":"'8-12-13'!$P37","v":0},{"$f":"'12-01-14'!$P37","v":0},{"$f":"'19-01-14'!$P37","v":0},{"$f":"'26-01-14'!$P37","v":0},{"$f":"'2-02-14'!$P37","v":0},null,null,60,60,23]
[]
["NOTE:"]